{"text_format":"1","workbook":"xlsx","n_sheets":3,"sheets":["Коэффициенты","(для форума)","Лист1"],"not_rendered":{"charts":0,"images":0,"macros":0,"external_links":0,"defined_names":1,"comments":0,"pivot_tables":0},"unopened":[],"bounds":{"document_bytes":16777216,"sheet_cells":100000,"rows_first":2000,"rows_last":500,"rows_between":2000,"halvings":0,"cell_chars":16384,"cell_head_chars":4096},"cells_cut":0,"cells_raw":0,"read":"whole","date_system":"1900"}

{"sheet":"Коэффициенты","index":0,"n_rows":200,"n_cols":66,"rows_kept":200,"cut":false,"hidden":false,"merged":[]}
[null,null,null,null,null,null,null,null,null,null,null,null,null,null,null,null,null,null,null,null,null,null,null,null,null,null,null,null,null,null,null,null,null,null,"КП","1,1 - 1,2","(КП - коэффициент полярности)",null,null,null,null,null,null,null,null,null,null,null,null,null,null,1,"1,0 - 1,1",1.1000000000000001,1.1499999999999999,"1,1 - 1,2","1,10 - 1,25",1.2,1.25]
[null,"ROGERS CUP 2012",null,null,"Инструкция для прогнозистов",null,null,null,null,null,null,null,null,"Категория турнира",null,null,null,null,null,null,null,null,null,null,null,null,null,null,null,null,null,null,null,null,"a",0.71199999999999997,"Функции, определяющие зависимость коэффициентов K1 и K2 от рейтинговых позиций R1 и R2:",null,null,null,null,null,null,null,null,null,"Круг","Очки (r)","Категория турнира",null,null,0.81,0.89,0.7030335019500692,0.65,0.71199999999999997,0.72,0.62,0.58499999999999996]
[null,"ROGERS CUP presented by National Bank",null,null,"Чтобы выяснить коэффициенты на матч, необходимо скопировать",null,null,null,null,null,null,null,null,"Masters (48 Draw)",null,null,null,null,null,null,null,null,null,null,null,null,null,null,null,null,null,null,null,null,"b",0.42699999999999999,"K1 = 10-LOG(R2/R1;a/R1^b+c)",null,null,null,null,null,null,null,null,null,1,{"$f":"CHOOSE(VLOOKUP($N$3,$AW$11:$AX$199,2,0),AV18,AV26,AV34,AV42,AV50,AV58,AV66)","v":0},{"$f":"N3","v":"Masters (48 Draw)"},null,null,0.36,0.34,0.35340491179549077,0.35,0.42699999999999999,0.45700000000000002,0.35,0.34499999999999997]
[null,"Место проведения: TORONTO, ONTARIO, CANADA",null,null,"имена теннисистов из столбца \"Имя\" справа в столбцы \"Имя 1\" и \"Имя 2\" слева",null,null,null,null,null,null,null,null,null,null,null,null,null,null,null,null,null,null,null,null,null,null,null,null,null,null,null,null,null,"c",1.2949999999999999,"K2 = 10+LOG(R2/R1;a/R1^b+c)",null,null,null,null,null,null,null,null,null,2,60,null,null,null,1.34,1.26,1.3027620503827977,1.29,1.2949999999999999,1.288,1.27,1.26,null,null,null,null,null,"i1",-13.704109304276312]
[null,"Дата: AUGUST 6-12, 2012",null,null,"в соответствующее матчу место в турнирной сетке",null,null,null,null,null,null,null,null,null,null,null,null,null,null,null,null,null,null,null,null,null,null,null,null,null,null,null,null,null,null,null,null,null,null,null,null,null,null,null,null,null,3,120,null,null,null,null,null,null,null,null,null,null,null,null,null,null,null,null,"i2",18.949041530105895]
[null,"Сетка: 48",null,null,null,null,null,null,null,null,null,null,null,null,null,null,null,null,null,null,null,null,null,null,null,null,null,null,null,null,null,null,null,null,"u",19820,"Функция, опрделяющая прогресс рейтинговой позиции R по турниру (r - рейтинговые очки):",null,null,null,null,null,null,"p",6,null,4,240,null,null,null,null,null,null,null,null,null,null,null,null,null,null,null,null,"i3",25.559763846313132]
[null,"Покрытие: Hard-Decoturf",null,null,"Коэффициенты и рейтинги по ходу турнира не пересматриваются",null,null,null,null,null,null,null,null,null,null,null,null,null,null,null,null,null,null,null,null,null,null,null,null,null,null,null,null,null,"v",0.76588463421686681,"Rnew = 1/((R+w)^(-v)+r/u)^(1/v)-w",null,null,null,null,null,null,"q",0.87,null,5,480,null,null,null,null,null,null,null,null,null,null,null,null,null,null,null,null,"i4",-55.804833788962043]
[null,"Призовые: US $2,648,700",null,null,null,null,null,null,null,null,null,null,null,null,null,null,null,null,null,null,null,null,null,null,null,null,null,null,null,null,null,null,null,null,"w",0.84576622374664212,"Грань прогресса =",null,1.4990000000000001,null,null,null,null,null,null,null,6,800,null,null,null,null,null,null,null,null,null,null,null,null,null,null,null,null,"i5",30.000109882866397]
[null,null,null,null,null,null,null,null,null,null,null,null,null,null,null,null,null,"(исправленный)",null,null,null,null,null,null,null,null,null,null,null,null,null,null,null,null,null,null,"(без прогресса)","(без прогресса)",null,null,null,null,null,null,null,null,7,""]
[null,null,null,"Имя 1","Имя 2","Коэф 1","Коэф 2","Рейтинг 1","Рейтинг 2",null,null,null,"Имя","Рейтинг",null,"Поправка",null,"Рейтинг",null,null,null,null,null,null,null,null,null,null,null,null,null,null,null,null,null,"Матч","Рейтинг 1 ","Рейтинг 2","Круг",null,"Вероятность 1","Вероятность 2",null,"Дельта","Дельта~",null,null,null,null,null,null,null,null,null,null,null,null,null,null,null,null,null,null,null,"Коэф 1 (20+)","Коэф 2 (20+)"]
[null,"Финал",1,{"$f":"'(для форума)'!J12","v":0},{"$f":"'(для форума)'!J13","v":0},{"$f":"IF(AND($H11<>\"\",$I11<>\"\"),ROUND((10+IF(H11<=I11,-1,1)*MIN(AS11,9.5))*2,0)/2,\"\")","v":{"$error":"#N/A"}},{"$f":"IF(AND($H11<>\"\",$I11<>\"\"),ROUND((10+IF(H11>I11,-1,1)*MIN(AS11,9.5))*2,0)/2,\"\")","v":{"$error":"#N/A"}},{"$f":"IF(AK11<>\"\",MAX(1/((AK11+$AJ$8)^(-$AJ$7)+VLOOKUP($AM11,$AU$3:$AV$9,2,0)/$AJ$6)^(1/$AJ$7)-$AJ$8,MIN(AK11,$AM$8)),\"\")","v":{"$error":"#N/A"}},{"$f":"IF(AL11<>\"\",MAX(1/((AL11+$AJ$8)^(-$AJ$7)+VLOOKUP($AM11,$AU$3:$AV$9,2,0)/$AJ$6)^(1/$AJ$7)-$AJ$8,MIN(AL11,$AM$8)),\"\")","v":{"$error":"#N/A"}},{"$f":"CONCATENATE(\"Пхх.6 \",D11,\" d. \",E11)","v":"Пхх.6 0 d. 0"},{"$f":"CONCATENATE(\"Пхх.6 \",E11,\" d. \",D11)","v":"Пхх.6 0 d. 0"},1,"R. Federer",1,null,null,null,{"$f":"IF(N11<>\"\",SUM(N11,P11),\"\")","v":1},null,null,null,null,null,null,null,null,null,null,null,null,null,null,null,1,{"$f":"IF(B11<>\"\",B11,\"\")","v":"Финал"},{"$f":"IF(C11<>\"\",C11,\"\")","v":1},{"$f":"IF(AND(D11<>\"\",D11<>\"(Q)\",D11<>\"bye\"),VLOOKUP(D11,$M$11:$R$200,6,0),\"\")","v":{"$error":"#N/A"}},{"$f":"IF(AND(E11<>\"\",E11<>\"(Q)\",E11<>\"bye\"),VLOOKUP(E11,$M$11:$T$200,6,0),\"\")","v":{"$error":"#N/A"}},{"$f":"IF(C11=\"\",\"\",IF(C12=\"\",1,IF(B12=\"\",AM12,AM12+1)))","v":6},null,{"$f":"IF(AND($H11<>\"\",$I11<>\"\"),0.5-IF(H11<=I11,-1,1)*MIN(AS11,9.99)/20,\"\")","v":{"$error":"#N/A"}},{"$f":"IF(AND($H11<>\"\",$I11<>\"\"),0.5-IF(H11>I11,-1,1)*MIN(AS11,9.99)/20,\"\")","v":{"$error":"#N/A"}},null,{"$f":"IF(AND($H11<>\"\",$I11<>\"\"),LOG(MAX(H11,I11)/MIN(H11,I11),MIN($AJ$2/MIN(H11,I11)^$AJ$3+$AJ$4,$AJ$2+$AJ$4)),\"\")","v":{"$error":"#N/A"}},{"$f":"IF(AR11<>\"\",IF(AR11<=$AS$6,AR11,(AR11-$AS$6+$AS$7^(1-$AS$7))^$AS$7+$AS$6-$AS$7^($AS$7*(1-$AS$7))),\"\")","v":{"$error":"#N/A"}},null,null,null,null,null,null,null,null,null,null,null,null,null,null,null,null,null,null,null,{"$f":"IF(AND($H11<>\"\",$I11<>\"\"),ROUND(($BN$4*AO11^4+$BN$5*AO11^3+$BN$6*AO11^2+$BN$7*AO11+$BN$8)*2,0)/2,\"\")","v":{"$error":"#N/A"}},{"$f":"IF(AND($H11<>\"\",$I11<>\"\"),ROUND(($BN$4*AP11^4+$BN$5*AP11^3+$BN$6*AP11^2+$BN$7*AP11+$BN$8)*2,0)/2,\"\")","v":{"$error":"#N/A"}}]
[null,"Полуфиналы",1,{"$f":"'(для форума)'!J14","v":0},{"$f":"'(для форума)'!J15","v":0},{"$f":"IF(AND($H12<>\"\",$I12<>\"\"),ROUND((10+IF(H12<=I12,-1,1)*MIN(AS12,9.5))*2,0)/2,\"\")","v":{"$error":"#N/A"}},{"$f":"IF(AND($H12<>\"\",$I12<>\"\"),ROUND((10+IF(H12>I12,-1,1)*MIN(AS12,9.5))*2,0)/2,\"\")","v":{"$error":"#N/A"}},{"$f":"IF(AK12<>\"\",MAX(1/((AK12+$AJ$8)^(-$AJ$7)+VLOOKUP($AM12,$AU$3:$AV$9,2,0)/$AJ$6)^(1/$AJ$7)-$AJ$8,MIN(AK12,$AM$8)),\"\")","v":{"$error":"#N/A"}},{"$f":"IF(AL12<>\"\",MAX(1/((AL12+$AJ$8)^(-$AJ$7)+VLOOKUP($AM12,$AU$3:$AV$9,2,0)/$AJ$6)^(1/$AJ$7)-$AJ$8,MIN(AL12,$AM$8)),\"\")","v":{"$error":"#N/A"}},{"$f":"CONCATENATE(\"Пхх.5 \",D12,\" d. \",E12)","v":"Пхх.5 0 d. 0"},{"$f":"CONCATENATE(\"Пхх.5 \",E12,\" d. \",D12)","v":"Пхх.5 0 d. 0"},2,"N. Djokovic",2,null,null,null,2,null,null,null,null,null,null,null,null,null,null,null,null,null,null,null,1,"Полуфиналы",1,{"$error":"#N/A"},{"$error":"#N/A"},5,null,{"$error":"#N/A"},{"$error":"#N/A"},null,{"$f":"IF(AND($H12<>\"\",$I12<>\"\"),LOG(MAX(H12,I12)/MIN(H12,I12),MIN($AJ$2/MIN(H12,I12)^$AJ$3+$AJ$4,$AJ$2+$AJ$4)),\"\")","v":{"$error":"#N/A"}},{"$f":"IF(AR12<>\"\",IF(AR12<=$AS$6,AR12,(AR12-$AS$6+$AS$7^(1-$AS$7))^$AS$7+$AS$6-$AS$7^($AS$7*(1-$AS$7))),\"\")","v":{"$error":"#N/A"}},null,null,null,{"$f":"\"\"","v":""},null,null,null,null,null,null,null,null,null,null,null,null,null,null,null,{"$error":"#N/A"},{"$error":"#N/A"}]
[null,null,2,{"$f":"'(для форума)'!J16","v":0},{"$f":"'(для форума)'!J17","v":0},{"$error":"#N/A"},{"$error":"#N/A"},{"$error":"#N/A"},{"$error":"#N/A"},{"$f":"CONCATENATE(\"Пхх.5 \",D13,\" d. \",E13)","v":"Пхх.5 0 d. 0"},{"$f":"CONCATENATE(\"Пхх.5 \",E13,\" d. \",D13)","v":"Пхх.5 0 d. 0"},3,"R. Nadal",3,null,null,null,3,null,null,null,null,null,null,null,null,null,null,null,null,null,null,null,2,"",2,{"$error":"#N/A"},{"$error":"#N/A"},5,null,{"$error":"#N/A"},{"$error":"#N/A"},null,{"$error":"#N/A"},{"$error":"#N/A"},null,null,null,{"$f":"\"\"","v":""},null,null,null,null,null,null,null,null,null,null,null,null,null,null,null,{"$error":"#N/A"},{"$error":"#N/A"}]
[null,"Четвертьфиналы",1,{"$f":"'(для форума)'!J18","v":0},{"$f":"'(для форума)'!J19","v":0},{"$error":"#N/A"},{"$error":"#N/A"},{"$error":"#N/A"},{"$error":"#N/A"},{"$f":"CONCATENATE(\"Пхх.4 \",D14,\" d. \",E14)","v":"Пхх.4 0 d. 0"},{"$f":"CONCATENATE(\"Пхх.4 \",E14,\" d. \",D14)","v":"Пхх.4 0 d. 0"},4,"A. Murray",4,null,null,null,4,null,null,null,null,null,null,null,null,null,null,null,null,null,null,null,1,"Четвертьфиналы",1,{"$error":"#N/A"},{"$error":"#N/A"},4,null,{"$error":"#N/A"},{"$error":"#N/A"},null,{"$error":"#N/A"},{"$error":"#N/A"},null,null,null,{"$f":"\"\"","v":""},null,null,null,null,null,null,null,null,null,null,null,null,null,null,null,{"$error":"#N/A"},{"$error":"#N/A"}]
[null,null,2,{"$f":"'(для форума)'!J20","v":0},{"$f":"'(для форума)'!J21","v":0},{"$error":"#N/A"},{"$error":"#N/A"},{"$error":"#N/A"},{"$error":"#N/A"},{"$f":"CONCATENATE(\"Пхх.4 \",D15,\" d. \",E15)","v":"Пхх.4 0 d. 0"},{"$f":"CONCATENATE(\"Пхх.4 \",E15,\" d. \",D15)","v":"Пхх.4 0 d. 0"},5,"D. Ferrer",5,null,null,null,5,null,null,null,null,null,null,null,null,null,null,null,null,null,null,null,2,"",2,{"$error":"#N/A"},{"$error":"#N/A"},4,null,{"$error":"#N/A"},{"$error":"#N/A"},null,{"$error":"#N/A"},{"$error":"#N/A"},null,null,null,{"$f":"\"\"","v":""},null,null,null,null,null,null,null,null,null,null,null,null,null,null,null,{"$error":"#N/A"},{"$error":"#N/A"}]
[null,null,3,{"$f":"'(для форума)'!J22","v":0},{"$f":"'(для форума)'!J23","v":0},{"$error":"#N/A"},{"$error":"#N/A"},{"$error":"#N/A"},{"$error":"#N/A"},{"$f":"CONCATENATE(\"Пхх.4 \",D16,\" d. \",E16)","v":"Пхх.4 0 d. 0"},{"$f":"CONCATENATE(\"Пхх.4 \",E16,\" d. \",D16)","v":"Пхх.4 0 d. 0"},6,"J.-W. Tsonga",6,null,null,null,6,null,null,null,null,null,null,null,null,null,null,null,null,null,null,null,3,"",3,{"$error":"#N/A"},{"$error":"#N/A"},4,null,{"$error":"#N/A"},{"$error":"#N/A"},null,{"$error":"#N/A"},{"$error":"#N/A"},null,"(Список категорий турниров)",null,{"$f":"\"\"","v":""},"Индекс","Индекс",null,null,null,null,null,null,null,null,null,null,null,null,null,{"$error":"#N/A"},{"$error":"#N/A"}]
[null,null,4,{"$f":"'(для форума)'!J24","v":0},{"$f":"'(для форума)'!J25","v":0},{"$error":"#N/A"},{"$error":"#N/A"},{"$error":"#N/A"},{"$error":"#N/A"},{"$f":"CONCATENATE(\"Пхх.4 \",D17,\" d. \",E17)","v":"Пхх.4 0 d. 0"},{"$f":"CONCATENATE(\"Пхх.4 \",E17,\" d. \",D17)","v":"Пхх.4 0 d. 0"},7,"T. Berdych",7,null,null,null,7,null,null,null,null,null,null,null,null,null,null,null,null,null,null,null,4,"",4,{"$error":"#N/A"},{"$error":"#N/A"},4,null,{"$error":"#N/A"},{"$error":"#N/A"},null,{"$error":"#N/A"},{"$error":"#N/A"},null,null,null,{"$f":"\"\"","v":""},"категории","сетки",null,null,null,null,null,null,null,null,null,null,null,null,null,{"$error":"#N/A"},{"$error":"#N/A"}]
[null,{"$f":"CHOOSE(VLOOKUP($N$3,$AW$11:$AX$199,2,0),AU84,AU84,AU85,AU85,AU86,AU85,AU86)","v":"Третий круг"},1,{"$f":"'(для форума)'!J26","v":0},{"$f":"'(для форума)'!J27","v":0},{"$error":"#N/A"},{"$error":"#N/A"},{"$error":"#N/A"},{"$error":"#N/A"},{"$f":"CONCATENATE(\"Пхх.3 \",D18,\" d. \",E18)","v":"Пхх.3 0 d. 0"},{"$f":"CONCATENATE(\"Пхх.3 \",E18,\" d. \",D18)","v":"Пхх.3 0 d. 0"},8,"J. Tipsarevic",8,null,null,null,8,null,null,null,null,null,null,null,null,null,null,null,null,null,null,null,1,"Третий круг",1,{"$error":"#N/A"},{"$error":"#N/A"},3,null,{"$error":"#N/A"},{"$error":"#N/A"},null,{"$error":"#N/A"},{"$error":"#N/A"},null,1,0,"Grand Slam (128 Draw)",1,1,null,null,null,null,null,null,null,null,null,null,null,null,null,{"$error":"#N/A"},{"$error":"#N/A"}]
[null,null,2,{"$f":"'(для форума)'!J28","v":0},{"$f":"'(для форума)'!J29","v":0},{"$error":"#N/A"},{"$error":"#N/A"},{"$error":"#N/A"},{"$error":"#N/A"},"Пхх.3 0 d. 0","Пхх.3 0 d. 0",9,"J.M. Del Potro",9,null,null,null,9,null,null,null,null,null,null,null,null,null,null,null,null,null,null,null,2,"",2,{"$error":"#N/A"},{"$error":"#N/A"},3,null,{"$error":"#N/A"},{"$error":"#N/A"},null,{"$error":"#N/A"},{"$error":"#N/A"},null,2,45,null,null,null,null,null,null,null,null,null,null,null,null,null,null,null,null,{"$error":"#N/A"},{"$error":"#N/A"}]
[null,null,3,{"$f":"'(для форума)'!J30","v":0},{"$f":"'(для форума)'!J31","v":0},{"$error":"#N/A"},{"$error":"#N/A"},{"$error":"#N/A"},{"$error":"#N/A"},"Пхх.3 0 d. 0","Пхх.3 0 d. 0",10,"J. Monaco",10,null,null,null,10,null,null,null,null,null,null,null,null,null,null,null,null,null,null,null,3,"",3,{"$error":"#N/A"},{"$error":"#N/A"},3,null,{"$error":"#N/A"},{"$error":"#N/A"},null,{"$error":"#N/A"},{"$error":"#N/A"},null,3,90,null,null,null,null,null,null,null,null,null,null,null,null,null,null,null,null,{"$error":"#N/A"},{"$error":"#N/A"}]
[null,null,4,{"$f":"'(для форума)'!J32","v":0},{"$f":"'(для форума)'!J33","v":0},{"$error":"#N/A"},{"$error":"#N/A"},{"$error":"#N/A"},{"$error":"#N/A"},"Пхх.3 0 d. 0","Пхх.3 0 d. 0",11,"J. Isner",11,null,null,null,11,null,null,null,null,null,null,null,null,null,null,null,null,null,null,null,4,"",4,{"$error":"#N/A"},{"$error":"#N/A"},3,null,{"$error":"#N/A"},{"$error":"#N/A"},null,{"$error":"#N/A"},{"$error":"#N/A"},null,4,180,null,null,null,null,null,null,null,null,null,null,null,null,null,null,null,null,{"$error":"#N/A"},{"$error":"#N/A"}]
[null,null,5,{"$f":"'(для форума)'!J34","v":0},{"$f":"'(для форума)'!J35","v":0},{"$error":"#N/A"},{"$error":"#N/A"},{"$error":"#N/A"},{"$error":"#N/A"},"Пхх.3 0 d. 0","Пхх.3 0 d. 0",12,"N. Almagro",12,null,null,null,12,null,null,null,null,null,null,null,null,null,null,null,null,null,null,null,5,"",5,{"$error":"#N/A"},{"$error":"#N/A"},3,null,{"$error":"#N/A"},{"$error":"#N/A"},null,{"$error":"#N/A"},{"$error":"#N/A"},null,5,360,null,null,null,null,null,null,null,null,null,null,null,null,null,null,null,null,{"$error":"#N/A"},{"$error":"#N/A"}]
[null,null,6,{"$f":"'(для форума)'!J36","v":0},{"$f":"'(для форума)'!J37","v":0},{"$error":"#N/A"},{"$error":"#N/A"},{"$error":"#N/A"},{"$error":"#N/A"},"Пхх.3 0 d. 0","Пхх.3 0 d. 0",13,"G. Simon",13,null,null,null,13,null,null,null,null,null,null,null,null,null,null,null,null,null,null,null,6,"",6,{"$error":"#N/A"},{"$error":"#N/A"},3,null,{"$error":"#N/A"},{"$error":"#N/A"},null,{"$error":"#N/A"},{"$error":"#N/A"},null,6,720,null,null,null,null,null,null,null,null,null,null,null,null,null,null,null,null,{"$error":"#N/A"},{"$error":"#N/A"}]
[null,null,7,{"$f":"'(для форума)'!J38","v":0},{"$f":"'(для форума)'!J39","v":0},{"$error":"#N/A"},{"$error":"#N/A"},{"$error":"#N/A"},{"$error":"#N/A"},"Пхх.3 0 d. 0","Пхх.3 0 d. 0",14,"M. Cilic",14,null,null,null,14,null,null,null,null,null,null,null,null,null,null,null,null,null,null,null,7,"",7,{"$error":"#N/A"},{"$error":"#N/A"},3,null,{"$error":"#N/A"},{"$error":"#N/A"},null,{"$error":"#N/A"},{"$error":"#N/A"},null,7,1200,null,null,null,null,null,null,null,null,null,null,null,null,null,null,null,null,{"$error":"#N/A"},{"$error":"#N/A"}]
[null,null,8,{"$f":"'(для форума)'!J40","v":0},{"$f":"'(для форума)'!J41","v":0},{"$error":"#N/A"},{"$error":"#N/A"},{"$error":"#N/A"},{"$error":"#N/A"},"Пхх.3 0 d. 0","Пхх.3 0 d. 0",15,"M. Fish",15,null,null,null,15,null,null,null,null,null,null,null,null,null,null,null,null,null,null,null,8,"",8,{"$error":"#N/A"},{"$error":"#N/A"},3,null,{"$error":"#N/A"},{"$error":"#N/A"},null,{"$error":"#N/A"},{"$error":"#N/A"},null,null,null,null,null,null,null,null,null,null,null,null,null,null,null,null,null,null,null,{"$error":"#N/A"},{"$error":"#N/A"}]
[null,{"$f":"CHOOSE(VLOOKUP($N$3,$AW$11:$AX$199,2,0),AU85,AU85,AU86,AU86,AU87,AU86,AU87)","v":"Второй круг"},1,{"$f":"'(для форума)'!J42","v":0},{"$f":"'(для форума)'!J43","v":0},{"$error":"#N/A"},{"$error":"#N/A"},{"$error":"#N/A"},{"$error":"#N/A"},{"$f":"CONCATENATE(\"Пхх.2 \",D26,\" d. \",E26)","v":"Пхх.2 0 d. 0"},{"$f":"CONCATENATE(\"Пхх.2 \",E26,\" d. \",D26)","v":"Пхх.2 0 d. 0"},16,"P. Kohlschreiber",16,null,null,null,16,null,null,null,null,null,null,null,null,null,null,null,null,null,null,null,1,"Второй круг",1,{"$f":"IF(AND(D26<>\"\",D26<>\"(Q)\",D26<>\"bye\"),VLOOKUP(D26,$M$11:$R$200,6,0),\"\")","v":{"$error":"#N/A"}},{"$error":"#N/A"},2,null,{"$error":"#N/A"},{"$error":"#N/A"},null,{"$error":"#N/A"},{"$error":"#N/A"},null,1,0,"Masters (96 Draw)",2,2,null,null,null,null,null,null,null,null,null,null,null,null,null,{"$error":"#N/A"},{"$error":"#N/A"}]
[null,null,2,{"$f":"'(для форума)'!J44","v":0},{"$f":"'(для форума)'!J45","v":0},{"$error":"#N/A"},{"$error":"#N/A"},{"$error":"#N/A"},{"$error":"#N/A"},"Пхх.2 0 d. 0","Пхх.2 0 d. 0",17,"K. Nishikori",17,null,null,null,17,null,null,null,null,null,null,null,null,null,null,null,null,null,null,null,2,"",2,{"$error":"#N/A"},{"$error":"#N/A"},2,null,{"$error":"#N/A"},{"$error":"#N/A"},null,{"$error":"#N/A"},{"$error":"#N/A"},null,2,35,null,null,null,null,null,null,null,null,null,null,null,null,null,null,null,null,{"$error":"#N/A"},{"$error":"#N/A"}]
[null,null,3,{"$f":"'(для форума)'!J46","v":0},{"$f":"'(для форума)'!J47","v":0},{"$error":"#N/A"},{"$error":"#N/A"},{"$error":"#N/A"},{"$error":"#N/A"},"Пхх.2 0 d. 0","Пхх.2 0 d. 0",18,"G. Monfils",19,null,null,null,19,null,null,null,null,null,null,null,null,null,null,null,null,null,null,null,3,"",3,{"$error":"#N/A"},{"$error":"#N/A"},2,null,{"$error":"#N/A"},{"$error":"#N/A"},null,{"$error":"#N/A"},{"$error":"#N/A"},null,3,60,null,null,null,null,null,null,null,null,null,null,null,null,null,null,null,null,{"$error":"#N/A"},{"$error":"#N/A"}]
[null,null,4,{"$f":"'(для форума)'!J48","v":0},{"$f":"'(для форума)'!J49","v":0},{"$error":"#N/A"},{"$error":"#N/A"},{"$error":"#N/A"},{"$error":"#N/A"},"Пхх.2 0 d. 0","Пхх.2 0 d. 0",19,"R. Gasquet",20,null,null,null,20,null,null,null,null,null,null,null,null,null,null,null,null,null,null,null,4,"",4,{"$error":"#N/A"},{"$error":"#N/A"},2,null,{"$error":"#N/A"},{"$error":"#N/A"},null,{"$error":"#N/A"},{"$error":"#N/A"},null,4,120,null,null,null,null,null,null,null,null,null,null,null,null,null,null,null,null,{"$error":"#N/A"},{"$error":"#N/A"}]
[null,null,5,{"$f":"'(для форума)'!J50","v":0},{"$f":"'(для форума)'!J51","v":0},{"$error":"#N/A"},{"$error":"#N/A"},{"$error":"#N/A"},{"$error":"#N/A"},"Пхх.2 0 d. 0","Пхх.2 0 d. 0",20,"A. Roddick",21,null,null,null,21,null,null,null,null,null,null,null,null,null,null,null,null,null,null,null,5,"",5,{"$error":"#N/A"},{"$error":"#N/A"},2,null,{"$error":"#N/A"},{"$error":"#N/A"},null,{"$error":"#N/A"},{"$error":"#N/A"},null,5,240,null,null,null,null,null,null,null,null,null,null,null,null,null,null,null,null,{"$error":"#N/A"},{"$error":"#N/A"}]
[null,null,6,{"$f":"'(для форума)'!J52","v":0},{"$f":"'(для форума)'!J53","v":0},{"$error":"#N/A"},{"$error":"#N/A"},{"$error":"#N/A"},{"$error":"#N/A"},"Пхх.2 0 d. 0","Пхх.2 0 d. 0",21,"F. Mayer",22,null,null,null,22,null,null,null,null,null,null,null,null,null,null,null,null,null,null,null,6,"",6,{"$error":"#N/A"},{"$error":"#N/A"},2,null,{"$error":"#N/A"},{"$error":"#N/A"},null,{"$error":"#N/A"},{"$error":"#N/A"},null,6,480,null,null,null,null,null,null,null,null,null,null,null,null,null,null,null,null,{"$error":"#N/A"},{"$error":"#N/A"}]
[null,null,7,{"$f":"'(для форума)'!J54","v":0},{"$f":"'(для форума)'!J55","v":0},{"$error":"#N/A"},{"$error":"#N/A"},{"$error":"#N/A"},{"$error":"#N/A"},"Пхх.2 0 d. 0","Пхх.2 0 d. 0",22,"M. Raonic",23,null,null,null,23,null,null,null,null,null,null,null,null,null,null,null,null,null,null,null,7,"",7,{"$error":"#N/A"},{"$error":"#N/A"},2,null,{"$error":"#N/A"},{"$error":"#N/A"},null,{"$error":"#N/A"},{"$error":"#N/A"},null,7,800,null,null,null,null,null,null,null,null,null,null,null,null,null,null,null,null,{"$error":"#N/A"},{"$error":"#N/A"}]
[null,null,8,{"$f":"'(для форума)'!J56","v":0},{"$f":"'(для форума)'!J57","v":0},{"$error":"#N/A"},{"$error":"#N/A"},{"$error":"#N/A"},{"$error":"#N/A"},"Пхх.2 0 d. 0","Пхх.2 0 d. 0",23,"S. Wawrinka",24,null,null,null,24,null,null,null,null,null,null,null,null,null,null,null,null,null,null,null,8,"",8,{"$error":"#N/A"},{"$error":"#N/A"},2,null,{"$error":"#N/A"},{"$error":"#N/A"},null,{"$error":"#N/A"},{"$error":"#N/A"},null,null,null,null,null,null,null,null,null,null,null,null,null,null,null,null,null,null,null,{"$error":"#N/A"},{"$error":"#N/A"}]
[null,null,9,{"$f":"'(для форума)'!J58","v":0},{"$f":"'(для форума)'!J59","v":0},{"$error":"#N/A"},{"$error":"#N/A"},{"$error":"#N/A"},{"$error":"#N/A"},"Пхх.2 0 d. 0","Пхх.2 0 d. 0",24,"A. Dolgopolov",25,null,null,null,25,null,null,null,null,null,null,null,null,null,null,null,null,null,null,null,9,"",9,{"$error":"#N/A"},{"$error":"#N/A"},2,null,{"$error":"#N/A"},{"$error":"#N/A"},null,{"$error":"#N/A"},{"$error":"#N/A"},null,1,0,"Masters (56 Draw)",3,3,null,null,null,null,null,null,null,null,null,null,null,null,null,{"$error":"#N/A"},{"$error":"#N/A"}]
[null,null,10,{"$f":"'(для форума)'!J60","v":0},{"$f":"'(для форума)'!J61","v":0},{"$error":"#N/A"},{"$error":"#N/A"},{"$error":"#N/A"},{"$error":"#N/A"},"Пхх.2 0 d. 0","Пхх.2 0 d. 0",25,"R. Stepanek",26,null,null,null,26,null,null,null,null,null,null,null,null,null,null,null,null,null,null,null,10,"",10,{"$error":"#N/A"},{"$error":"#N/A"},2,null,{"$error":"#N/A"},{"$error":"#N/A"},null,{"$error":"#N/A"},{"$error":"#N/A"},null,2,60,"Masters (48 Draw)",3,4,null,null,null,null,null,null,null,null,null,null,null,null,null,{"$error":"#N/A"},{"$error":"#N/A"}]
[null,null,11,{"$f":"'(для форума)'!J62","v":0},{"$f":"'(для форума)'!J63","v":0},{"$error":"#N/A"},{"$error":"#N/A"},{"$error":"#N/A"},{"$error":"#N/A"},"Пхх.2 0 d. 0","Пхх.2 0 d. 0",26,"M. Granollers",27,null,null,null,27,null,null,null,null,null,null,null,null,null,null,null,null,null,null,null,11,"",11,{"$error":"#N/A"},{"$error":"#N/A"},2,null,{"$error":"#N/A"},{"$error":"#N/A"},null,{"$error":"#N/A"},{"$error":"#N/A"},null,3,120,null,null,null,null,null,null,null,null,null,null,null,null,null,null,null,null,{"$error":"#N/A"},{"$error":"#N/A"}]
[null,null,12,{"$f":"'(для форума)'!J64","v":0},{"$f":"'(для форума)'!J65","v":0},{"$error":"#N/A"},{"$error":"#N/A"},{"$error":"#N/A"},{"$error":"#N/A"},"Пхх.2 0 d. 0","Пхх.2 0 d. 0",27,"A. Seppi",28,null,null,null,28,null,null,null,null,null,null,null,null,null,null,null,null,null,null,null,12,"",12,{"$error":"#N/A"},{"$error":"#N/A"},2,null,{"$error":"#N/A"},{"$error":"#N/A"},null,{"$error":"#N/A"},{"$error":"#N/A"},null,4,240,null,null,null,null,null,null,null,null,null,null,null,null,null,null,null,null,{"$error":"#N/A"},{"$error":"#N/A"}]
[null,null,13,{"$f":"'(для форума)'!J66","v":0},{"$f":"'(для форума)'!J67","v":0},{"$error":"#N/A"},{"$error":"#N/A"},{"$f":"IF(AK38<>\"\",MAX(1/((AK38+$AJ$8)^(-$AJ$7)+VLOOKUP($AM38,$AU$3:$AV$9,2,0)/$AJ$6)^(1/$AJ$7)-$AJ$8,MIN(AK38,$AM$8)),\"\")","v":{"$error":"#N/A"}},{"$error":"#N/A"},"Пхх.2 0 d. 0","Пхх.2 0 d. 0",28,"F. Lopez",29,null,null,null,29,null,null,null,null,null,null,null,null,null,null,null,null,null,null,null,13,"",13,{"$error":"#N/A"},{"$error":"#N/A"},2,null,{"$error":"#N/A"},{"$error":"#N/A"},null,{"$error":"#N/A"},{"$error":"#N/A"},null,5,480,null,null,null,null,null,null,null,null,null,null,null,null,null,null,null,null,{"$error":"#N/A"},{"$error":"#N/A"}]
[null,null,14,{"$f":"'(для форума)'!J68","v":0},{"$f":"'(для форума)'!J69","v":0},{"$error":"#N/A"},{"$error":"#N/A"},{"$error":"#N/A"},{"$error":"#N/A"},"Пхх.2 0 d. 0","Пхх.2 0 d. 0",29,"V. Troicki",30,null,null,null,30,null,null,null,null,null,null,null,null,null,null,null,null,null,null,null,14,"",14,{"$error":"#N/A"},{"$error":"#N/A"},2,null,{"$error":"#N/A"},{"$error":"#N/A"},null,{"$error":"#N/A"},{"$error":"#N/A"},null,6,800,null,null,null,null,null,null,null,null,null,null,null,null,null,null,null,null,{"$error":"#N/A"},{"$error":"#N/A"}]
[null,null,15,{"$f":"'(для форума)'!J70","v":0},{"$f":"'(для форума)'!J71","v":0},{"$error":"#N/A"},{"$error":"#N/A"},{"$error":"#N/A"},{"$error":"#N/A"},"Пхх.2 0 d. 0","Пхх.2 0 d. 0",30,"M. Youzhny",31,null,null,null,31,null,null,null,null,null,null,null,null,null,null,null,null,null,null,null,15,"",15,{"$error":"#N/A"},{"$error":"#N/A"},2,null,{"$error":"#N/A"},{"$error":"#N/A"},null,{"$error":"#N/A"},{"$error":"#N/A"},null,7,{"$f":"\"\"","v":""},null,null,null,null,null,null,null,null,null,null,null,null,null,null,null,null,{"$error":"#N/A"},{"$error":"#N/A"}]
[null,null,16,{"$f":"'(для форума)'!J72","v":0},{"$f":"'(для форума)'!J73","v":0},{"$error":"#N/A"},{"$error":"#N/A"},{"$error":"#N/A"},{"$error":"#N/A"},"Пхх.2 0 d. 0","Пхх.2 0 d. 0",31,"J. Benneteau",32,null,null,null,32,null,null,null,null,null,null,null,null,null,null,null,null,null,null,null,16,"",16,{"$error":"#N/A"},{"$error":"#N/A"},2,null,{"$error":"#N/A"},{"$error":"#N/A"},null,{"$error":"#N/A"},{"$error":"#N/A"},null,null,null,null,null,null,null,null,null,null,null,null,null,null,null,null,null,null,null,{"$error":"#N/A"},{"$error":"#N/A"}]
[null,{"$f":"CHOOSE(VLOOKUP($N$3,$AW$11:$AX$199,2,0),AU86,AU86,AU87,AU87,\"\",AU87,\"\")","v":"Первый круг"},{"$f":"CHOOSE(VLOOKUP($N$3,$AW$11:$AX$200,2,0),AH42,AH42,AH42,AH42,\"\",AH42,\"\")","v":1},"N. Djokovic","bye",{"$f":"IF(AND($H42<>\"\",$I42<>\"\"),ROUND((10+IF(H42<=I42,-1,1)*MIN(AS42,9.5))*2,0)/2,\"\")","v":""},{"$f":"IF(AND($H42<>\"\",$I42<>\"\"),ROUND((10+IF(H42>I42,-1,1)*MIN(AS42,9.5))*2,0)/2,\"\")","v":""},{"$f":"IF(AK42<>\"\",MAX(1/((AK42+$AJ$8)^(-$AJ$7)+VLOOKUP($AM42,$AU$3:$AV$9,2,0)/$AJ$6)^(1/$AJ$7)-$AJ$8,MIN(AK42,$AM$8)),\"\")","v":1.9999999999999993},{"$f":"IF(AL42<>\"\",MAX(1/((AL42+$AJ$8)^(-$AJ$7)+VLOOKUP($AM42,$AU$3:$AV$9,2,0)/$AJ$6)^(1/$AJ$7)-$AJ$8,MIN(AL42,$AM$8)),\"\")","v":""},{"$f":"CONCATENATE(\"Пхх.1 \",D42,\" d. \",E42)","v":"Пхх.1 N. Djokovic d. bye"},{"$f":"CONCATENATE(\"Пхх.1 \",E42,\" d. \",D42)","v":"Пхх.1 bye d. N. Djokovic"},32,"K. Anderson",34,null,null,null,34,null,null,null,null,null,null,null,null,null,null,null,null,null,null,null,1,"Первый круг",1,2,"",1,null,"","",null,"","",null,1,0,"ATP 500 (56 Draw)",4,3,null,null,null,null,null,null,null,null,null,null,null,null,null,"",""]
[null,null,2,"M. Berrer","B. Tomic",12.5,7.5,130.99999999999983,48.999999999999972,"Пхх.1 M. Berrer d. B. Tomic","Пхх.1 B. Tomic d. M. Berrer",33,"J. Melzer",37,null,null,null,37,null,null,null,null,null,null,null,null,null,null,null,null,null,null,null,2,{"$f":"IF(B43<>\"\",B43,\"\")","v":""},{"$f":"IF(C43<>\"\",C43,\"\")","v":2},{"$f":"IF(AND(D43<>\"\",D43<>\"(Q)\",D43<>\"bye\"),VLOOKUP(D43,$M$11:$R$200,6,0),\"\")","v":131},{"$f":"IF(AND(E43<>\"\",E43<>\"(Q)\",E43<>\"bye\"),VLOOKUP(E43,$M$11:$T$200,6,0),\"\")","v":49},{"$f":"IF(C43=\"\",\"\",IF(C44=\"\",1,IF(B44=\"\",AM44,AM44+1)))","v":1},null,0.36256797067383445,0.63743202932616549,null,2.7486405865233108,2.7486405865233108,null,2,25,"ATP 500 (48 Draw)",4,4,null,null,null,null,null,null,null,null,null,null,null,null,null,{"$f":"IF(AND($H43<>\"\",$I43<>\"\"),ROUND(($BN$4*AO43^4+$BN$5*AO43^3+$BN$6*AO43^2+$BN$7*AO43+$BN$8)*2,0)/2,\"\")","v":14},{"$f":"IF(AND($H43<>\"\",$I43<>\"\"),ROUND(($BN$4*AP43^4+$BN$5*AP43^3+$BN$6*AP43^2+$BN$7*AP43+$BN$8)*2,0)/2,\"\")","v":7.5}]
[null,null,3,"S. Querrey","J. Melzer",10,10,37.999999999999979,36.999999999999993,"Пхх.1 S. Querrey d. J. Melzer","Пхх.1 J. Melzer d. S. Querrey",34,"P. Andujar",39,null,null,null,39,null,null,null,null,null,null,null,null,null,null,null,null,null,null,null,3,"",3,38,37,1,null,0.49639362942369775,0.50360637057630231,null,7.2127411526045113E-2,7.2127411526045113E-2,null,3,60,null,null,null,null,null,null,null,null,null,null,null,null,null,null,null,null,10,10]
[null,null,4,"K. Nishikori","bye","","",16.999999999999993,"","Пхх.1 K. Nishikori d. bye","Пхх.1 bye d. K. Nishikori",35,"C. Berlocq",40,null,null,null,40,null,null,null,null,null,null,null,null,null,null,null,null,null,null,null,4,"",4,17,"",1,null,"","",null,"","",null,4,120,null,null,null,null,null,null,null,null,null,null,null,null,null,null,null,null,"",""]
[null,null,5,"G. Simon","bye","","",12.999999999999998,"","Пхх.1 G. Simon d. bye","Пхх.1 bye d. G. Simon",36,"B. Tomic",49,null,null,null,49,null,null,null,null,null,null,null,null,null,null,null,null,null,null,null,5,"",5,13,"",1,null,"","",null,"","",null,5,240,null,null,null,null,null,null,null,null,null,null,null,null,null,null,null,null,"",""]
[null,null,6,"T. Haas","D. Nalbandian",9.5,10.5,36.000000000000007,40.999999999999993,"Пхх.1 T. Haas d. D. Nalbandian","Пхх.1 D. Nalbandian d. T. Haas",37,"J.C. Ferrero",65,null,null,null,65,null,null,null,null,null,null,null,null,null,null,null,null,null,null,null,6,"",6,36,41,1,null,0.517528508481228,0.48247149151877206,null,0.35057016962455922,0.35057016962455922,null,6,400,null,null,null,null,null,null,null,null,null,null,null,null,null,null,null,null,9.5,10.5]
[null,null,7,"R. Stepanek","A. Dolgopolov",10,10,26.000000000000004,25,"Пхх.1 R. Stepanek d. A. Dolgopolov","Пхх.1 A. Dolgopolov d. R. Stepanek",38,"S. Querrey",38,null,null,null,38,null,null,null,null,null,null,null,null,null,null,null,null,null,null,null,7,"",7,26,25,1,null,0.49495538849281706,0.50504461150718294,null,0.10089223014365926,0.10089223014365926,null,7,{"$f":"\"\"","v":""},null,null,null,null,null,null,null,null,null,null,null,null,null,null,null,null,10,10]
[null,null,8,"J.M. Del Potro","bye","","",9,"","Пхх.1 J.M. Del Potro d. bye","Пхх.1 bye d. J.M. Del Potro",39,"J. Chardy",47,null,null,null,47,null,null,null,null,null,null,null,null,null,null,null,null,null,null,null,8,"",8,9,"",1,null,"","",null,"","",null,null,null,null,null,null,null,null,null,null,null,null,null,null,null,null,null,null,null,"",""]
[null,null,9,"J.-W. Tsonga","bye","","",5.9999999999999982,"","Пхх.1 J.-W. Tsonga d. bye","Пхх.1 bye d. J.-W. Tsonga",40,"V. Pospisil",87,null,null,null,87,null,null,null,null,null,null,null,null,null,null,null,null,null,null,null,9,"",9,6,"",1,null,"","",null,"","",null,1,0,"ATP 500 (32 Draw)",5,5,null,null,null,null,null,null,null,null,null,null,null,null,null,"",""]
[null,null,10,"J. Chardy","D. Young",9.5,10.5,46.999999999999993,58.999999999999986,"Пхх.1 J. Chardy d. D. Young","Пхх.1 D. Young d. J. Chardy",41,"P. Polansky",155,null,null,null,155,null,null,null,null,null,null,null,null,null,null,null,null,null,null,null,10,"",10,47,59,1,null,0.53162905818344952,0.46837094181655042,null,0.63258116366899142,0.63258116366899142,null,2,60,null,null,null,null,null,null,null,null,null,null,null,null,null,null,null,null,9.5,11]
[null,null,11,"S. Stakhovsky","M. Granollers",13.5,6.5,98.999999999999972,26.999999999999979,"Пхх.1 S. Stakhovsky d. M. Granollers","Пхх.1 M. Granollers d. S. Stakhovsky",42,"F. Dancevic",135,null,null,null,135,null,null,null,null,null,null,null,null,null,null,null,null,null,null,null,11,"",11,99,27,1,null,0.331166983378262,0.668833016621738,null,3.3766603324347599,3.3766603324347599,null,3,120,null,null,null,null,null,null,null,null,null,null,null,null,null,null,null,null,15,7]
[null,null,12,"F. Mayer","bye","","",21.999999999999989,"","Пхх.1 F. Mayer d. bye","Пхх.1 bye d. F. Mayer",43,"L. Lacko",55,null,null,null,55,null,null,null,null,null,null,null,null,null,null,null,null,null,null,null,12,"",12,22,"",1,null,"","",null,"","",null,4,240,null,null,null,null,null,null,null,null,null,null,null,null,null,null,null,null,"",""]
[null,null,13,"M. Cilic","bye","","",13.999999999999995,"","Пхх.1 M. Cilic d. bye","Пхх.1 bye d. M. Cilic",44,"Y.-H. Lu",70,null,null,null,70,null,null,null,null,null,null,null,null,null,null,null,null,null,null,null,13,"",13,14,"",1,null,"","",null,"","",null,5,400,null,null,null,null,null,null,null,null,null,null,null,null,null,null,null,null,"",""]
[null,null,14,"C. Berlocq","M. Baghdatis",9.5,10.5,39.999999999999993,45,"Пхх.1 C. Berlocq d. M. Baghdatis","Пхх.1 M. Baghdatis d. C. Berlocq",45,"M. Berrer",131,null,null,null,131,null,null,null,null,null,null,null,null,null,null,null,null,null,null,null,14,"",14,40,45,1,null,0.5160780348827716,0.48392196511722846,null,0.3215606976554311,0.3215606976554311,null,6,{"$f":"\"\"","v":""},null,null,null,null,null,null,null,null,null,null,null,null,null,null,null,null,9.5,10.5]
[null,null,15,"K. Anderson","M. Youzhny",10,10,34,30.999999999999982,"Пхх.1 K. Anderson d. M. Youzhny","Пхх.1 M. Youzhny d. K. Anderson",46,"S. Stakhovsky",99,null,null,null,99,null,null,null,null,null,null,null,null,null,null,null,null,null,null,null,15,"",15,34,31,1,null,0.4877801722312809,0.5122198277687191,null,0.24439655537438162,0.24439655537438162,null,7,{"$f":"\"\"","v":""},null,null,null,null,null,null,null,null,null,null,null,null,null,null,null,null,10.5,9.5]
[null,null,16,"J. Tipsarevic","bye","","",8,"","Пхх.1 J. Tipsarevic d. bye","Пхх.1 bye d. J. Tipsarevic",47,"M. Ebden",80,null,null,null,80,null,null,null,null,null,null,null,null,null,null,null,null,null,null,null,16,"",16,8,"",1,null,"","",null,"","",null,null,null,null,null,null,null,null,null,null,null,null,null,null,null,null,null,null,null,"",""]
[null,null,17,"J. Monaco","bye","","",10.000000000000002,"","Пхх.1 J. Monaco d. bye","Пхх.1 bye d. J. Monaco",48,"W. Odesnik",133,null,null,null,133,null,null,null,null,null,null,null,null,null,null,null,null,null,null,null,17,"",17,10,"",1,null,"","",null,"","",null,1,0,"ATP 250 (56 Draw)",6,3,null,null,null,null,null,null,null,null,null,null,null,null,null,"",""]
[null,null,18,"V. Pospisil","A. Seppi",13,7,86.999999999999972,27.999999999999982,"Пхх.1 V. Pospisil d. A. Seppi","Пхх.1 A. Seppi d. V. Pospisil",49,"F. Fognini",66,null,null,null,66,null,null,null,null,null,null,null,null,null,null,null,null,null,null,null,18,"",18,87,28,1,null,0.35197908735135336,0.6480209126486467,null,2.960418252972933,2.960418252972933,null,2,15,"ATP 250 (48 Draw)",6,4,null,null,null,null,null,null,null,null,null,null,null,null,null,14,7.5]
[null,null,19,"P. Polansky","M. Ebden",12,8,154.99999999999983,80.000000000000028,"Пхх.1 P. Polansky d. M. Ebden","Пхх.1 M. Ebden d. P. Polansky",50,"F. Cipolla",97,null,null,null,97,null,null,null,null,null,null,null,null,null,null,null,null,null,null,null,19,"",19,155,80,1,null,0.40266725596876529,0.59733274403123471,null,1.9466548806246948,1.9466548806246948,null,3,25,null,null,null,null,null,null,null,null,null,null,null,null,null,null,null,null,12.5,8]
[null,null,20,"M. Fish","bye","","",15.000000000000004,"","Пхх.1 M. Fish d. bye","Пхх.1 bye d. M. Fish",51,"T. Haas",36,null,null,null,36,null,null,null,null,null,null,null,null,null,null,null,null,null,null,null,20,"",20,15,"",1,null,"","",null,"","",null,4,60,null,null,null,null,null,null,null,null,null,null,null,null,null,null,null,null,"",""]
[null,null,21,"R. Gasquet","bye","","",20.000000000000004,"","Пхх.1 R. Gasquet d. bye","Пхх.1 bye d. R. Gasquet",52,"D. Nalbandian",41,null,null,null,41,null,null,null,null,null,null,null,null,null,null,null,null,null,null,null,21,"",21,20,"",1,null,"","",null,"","",null,5,120,null,null,null,null,null,null,null,null,null,null,null,null,null,null,null,null,"",""]
[null,null,22,"M. Kukushkin","F. Dancevic",8,12,68.999999999999957,135,"Пхх.1 M. Kukushkin d. F. Dancevic","Пхх.1 F. Dancevic d. M. Kukushkin",53,"M. Baghdatis",45,null,null,null,45,null,null,null,null,null,null,null,null,null,null,null,null,null,null,null,22,"",22,69,135,1,null,0.59731684245157401,0.40268315754842604,null,1.9463368490314792,1.9463368490314792,null,6,200,null,null,null,null,null,null,null,null,null,null,null,null,null,null,null,null,8,12.5]
[null,null,23,"J. Benneteau","W. Odesnik",6,14,32,132.99999999999989,"Пхх.1 J. Benneteau d. W. Odesnik","Пхх.1 W. Odesnik d. J. Benneteau",54,"A. Ramos",46,null,null,null,46,null,null,null,null,null,null,null,null,null,null,null,null,null,null,null,23,"",23,32,133,1,null,0.68921798261840816,0.31078201738159189,null,3.784359652368162,3.784359652368162,null,7,{"$f":"\"\"","v":""},null,null,null,null,null,null,null,null,null,null,null,null,null,null,null,null,7,15.5]
[null,null,24,"T. Berdych","bye","","",7,"","Пхх.1 T. Berdych d. bye","Пхх.1 bye d. T. Berdych",55,"A. Bogomolov Jr.",58,null,null,null,58,null,null,null,null,null,null,null,null,null,null,null,null,null,null,null,24,"",24,7,"",1,null,"","",null,"","",null,null,null,null,null,null,null,null,null,null,null,null,null,null,null,null,null,null,null,"",""]
[null,null,25,"J. Isner","bye","","",10.999999999999998,"","Пхх.1 J. Isner d. bye","Пхх.1 bye d. J. Isner",56,"D. Young",59,null,null,null,59,null,null,null,null,null,null,null,null,null,null,null,null,null,null,null,25,"",25,11,"",1,null,{"$f":"IF(AND($H66<>\"\",$I66<>\"\"),0.5-IF(H66<=I66,-1,1)*MIN(AS66,9.99)/20,\"\")","v":""},{"$f":"IF(AND($H66<>\"\",$I66<>\"\"),0.5-IF(H66>I66,-1,1)*MIN(AS66,9.99)/20,\"\")","v":""},null,"","",null,1,0,"ATP 250 (32 Draw)",7,5,null,null,null,null,null,null,null,null,null,null,null,null,null,"",""]
[null,null,26,"P. Andujar","L. Lacko",9,11,38.999999999999993,54.999999999999993,"Пхх.1 P. Andujar d. L. Lacko","Пхх.1 L. Lacko d. P. Andujar",57,"R. Harrison",60,null,null,null,60,null,null,null,null,null,null,null,null,null,null,null,null,null,null,null,26,"",26,39,55,1,null,{"$f":"IF(AND($H67<>\"\",$I67<>\"\"),0.5-IF(H67<=I67,-1,1)*MIN(AS67,9.99)/20,\"\")","v":0.54678494726960025},{"$f":"IF(AND($H67<>\"\",$I67<>\"\"),0.5-IF(H67>I67,-1,1)*MIN(AS67,9.99)/20,\"\")","v":0.4532150527303998},null,0.93569894539200404,0.93569894539200404,null,2,25,"ATP 250 (28 Draw)",7,6,null,null,null,null,null,null,null,null,null,null,null,null,null,9,11]
[null,null,27,"Y.-H. Lu","F. Fognini",10,10,69.999999999999915,65.999999999999986,"Пхх.1 Y.-H. Lu d. F. Fognini","Пхх.1 F. Fognini d. Y.-H. Lu",58,"M. Kukushkin",69,null,null,null,69,null,null,null,null,null,null,null,null,null,null,null,null,null,null,null,27,"",27,70,66,1,null,0.49150735142169544,0.50849264857830456,null,0.16985297156609144,0.16985297156609144,null,3,60,null,null,null,null,null,null,null,null,null,null,null,null,null,null,null,null,10,10]
[null,null,28,"P. Kohlschreiber","bye","","",16.000000000000004,"","Пхх.1 P. Kohlschreiber d. bye","Пхх.1 bye d. P. Kohlschreiber",59,"L. Kubot",73,null,null,null,73,null,null,null,null,null,null,null,null,null,null,null,null,null,null,null,28,"",28,16,"",1,null,"","",null,"","",null,4,120,null,null,null,null,null,null,null,null,null,null,null,null,null,null,null,null,"",""]
[null,null,29,"M. Raonic","bye","","",22.999999999999986,"","Пхх.1 M. Raonic d. bye","Пхх.1 bye d. M. Raonic",60,"J. Zopp",82,null,null,null,82,null,null,null,null,null,null,null,null,null,null,null,null,null,null,null,29,"",29,23,"",1,null,"","",null,"","",null,5,200,null,null,null,null,null,null,null,null,null,null,null,null,null,null,null,null,"",""]
[null,null,30,"A. Bogomolov Jr.","V. Troicki",11.5,8.5,57.999999999999979,29.999999999999993,"Пхх.1 A. Bogomolov Jr. d. V. Troicki","Пхх.1 V. Troicki d. A. Bogomolov Jr.",61,null,null,null,null,null,"",null,null,null,null,null,null,null,null,null,null,null,null,null,null,null,30,"",30,58,30,1,null,0.41315458680541384,0.58684541319458616,null,1.7369082638917226,1.7369082638917226,null,6,{"$f":"\"\"","v":""},null,null,null,null,null,null,null,null,null,null,null,null,null,null,null,null,12,8.5]
[null,null,31,"F. Cipolla","J. Zopp",10.5,9.5,96.999999999999957,82,"Пхх.1 F. Cipolla d. J. Zopp","Пхх.1 J. Zopp d. F. Cipolla",62,null,null,null,null,null,"",null,null,null,null,null,null,null,null,null,null,null,null,null,null,null,31,"",31,97,82,1,null,0.47521827194180105,0.52478172805819889,null,0.49563456116397869,0.49563456116397869,null,7,{"$f":"\"\"","v":""},null,null,null,null,null,null,null,null,null,null,null,null,null,null,null,null,10.5,9.5]
[null,null,32,"A. Murray","bye","","",4,"","Пхх.1 A. Murray d. bye","Пхх.1 bye d. A. Murray",63,null,null,null,null,null,"",null,null,null,null,null,null,null,null,null,null,null,null,null,null,null,32,"",32,4,"",1,null,"","",null,"","",null,null,null,null,null,null,null,null,null,null,null,null,null,null,null,null,null,null,null,"",""]
[null,{"$f":"CHOOSE(VLOOKUP($N$3,$AW$11:$AX$199,2,0),AU87,AU87,\"\",\"\",\"\",\"\",\"\")","v":""},{"$f":"CHOOSE(VLOOKUP($N$3,$AW$11:$AX$200,2,0),AH74,AH74,\"\",\"\",\"\",\"\",\"\")","v":""},null,null,{"$f":"IF(AND($H74<>\"\",$I74<>\"\"),ROUND((10+IF(H74<=I74,-1,1)*MIN(AS74,9.5))*2,0)/2,\"\")","v":""},{"$f":"IF(AND($H74<>\"\",$I74<>\"\"),ROUND((10+IF(H74>I74,-1,1)*MIN(AS74,9.5))*2,0)/2,\"\")","v":""},{"$f":"IF(AK74<>\"\",MAX(1/((AK74+$AJ$8)^(-$AJ$7)+VLOOKUP($AM74,$AU$3:$AV$9,2,0)/$AJ$6)^(1/$AJ$7)-$AJ$8,MIN(AK74,$AM$8)),\"\")","v":""},{"$f":"IF(AL74<>\"\",MAX(1/((AL74+$AJ$8)^(-$AJ$7)+VLOOKUP($AM74,$AU$3:$AV$9,2,0)/$AJ$6)^(1/$AJ$7)-$AJ$8,MIN(AL74,$AM$8)),\"\")","v":""},null,null,64,null,null,null,null,null,"",null,null,null,null,null,null,null,null,null,null,null,null,null,null,null,1,"","","","","",null,"","",null,"","",null,null,null,null,null,null,null,null,null,null,null,null,null,null,null,null,null,null,null,"",""]
[null,null,"",null,null,"","","","",null,null,{"$f":"L74+1","v":65},null,null,null,null,null,"",null,null,null,null,null,null,null,null,null,null,null,null,null,null,null,2,{"$f":"IF(B75<>\"\",B75,\"\")","v":""},{"$f":"IF(C75<>\"\",C75,\"\")","v":""},{"$f":"IF(AND(D75<>\"\",D75<>\"(Q)\",D75<>\"bye\"),VLOOKUP(D75,$M$11:$R$200,6,0),\"\")","v":""},{"$f":"IF(AND(E75<>\"\",E75<>\"(Q)\",E75<>\"bye\"),VLOOKUP(E75,$M$11:$T$200,6,0),\"\")","v":""},{"$f":"IF(C75=\"\",\"\",IF(C76=\"\",1,IF(B76=\"\",AM76,AM76+1)))","v":""},null,"","",null,"","",null,null,null,null,null,null,null,null,null,null,null,null,null,null,null,null,null,null,null,{"$f":"IF(AND($H75<>\"\",$I75<>\"\"),ROUND(($BN$4*AO75^4+$BN$5*AO75^3+$BN$6*AO75^2+$BN$7*AO75+$BN$8)*2,0)/2,\"\")","v":""},{"$f":"IF(AND($H75<>\"\",$I75<>\"\"),ROUND(($BN$4*AP75^4+$BN$5*AP75^3+$BN$6*AP75^2+$BN$7*AP75+$BN$8)*2,0)/2,\"\")","v":""}]
[null,null,"",null,null,"","","","",null,null,{"$f":"L75+1","v":66},null,null,null,null,null,{"$f":"IF(N76<>\"\",SUM(N76,P76),\"\")","v":""},null,null,null,null,null,null,null,null,null,null,null,null,null,null,null,3,"","","","","",null,"","",null,{"$f":"IF(AND($H76<>\"\",$I76<>\"\"),LOG(MAX(H76,I76)/MIN(H76,I76),MIN($AJ$2/MIN(H76,I76)^$AJ$3+$AJ$4,$AJ$2+$AJ$4)),\"\")","v":""},{"$f":"IF(AR76<>\"\",IF(AR76<=$AS$6,AR76,(AR76-$AS$6+$AS$7^(1-$AS$7))^$AS$7+$AS$6-$AS$7^($AS$7*(1-$AS$7))),\"\")","v":""},null,null,null,null,null,null,null,null,null,null,null,null,null,null,null,null,null,null,null,"",""]
[null,null,"",null,null,"","","","",null,null,67,null,null,null,null,null,"",null,null,null,null,null,null,null,null,null,null,null,null,null,null,null,4,"","","","","",null,"","",null,"","",null,null,null,null,null,null,null,null,null,null,null,null,null,null,null,null,null,null,null,"",""]
[null,null,"",null,null,"","","","",null,null,68,null,null,null,null,null,"",null,null,null,null,null,null,null,null,null,null,null,null,null,null,null,5,"","","","","",null,"","",null,"","",null,null,null,null,null,null,null,null,null,null,null,null,null,null,null,null,null,null,null,"",""]
[null,null,"",null,null,"","","","",null,null,69,null,null,null,null,null,"",null,null,null,null,null,null,null,null,null,null,null,null,null,null,null,6,"","","","","",null,"","",null,"","",null,null,null,null,null,null,null,null,null,null,null,null,null,null,null,null,null,null,null,"",""]
[null,null,"",null,null,"","","","",null,null,70,null,null,null,null,null,"",null,null,null,null,null,null,null,null,null,null,null,null,null,null,null,7,"","","","","",null,"","",null,"","",null,"(Список кругов)",null,null,null,null,null,null,null,null,null,null,null,null,null,null,null,null,null,"",""]
[null,null,"",null,null,"","","","",null,null,71,null,null,null,null,null,"",null,null,null,null,null,null,null,null,null,null,null,null,null,null,null,8,"","","","","",null,"","",null,"","",null,"Финал",null,null,null,null,null,null,null,null,null,null,null,null,null,null,null,null,null,"",""]
[null,null,"",null,null,"","","","",null,null,72,null,null,null,null,null,"",null,null,null,null,null,null,null,null,null,null,null,null,null,null,null,9,"","","","","",null,"","",null,"","",null,"Полуфиналы",null,null,null,null,null,null,null,null,null,null,null,null,null,null,null,null,null,"",""]
[null,null,"",null,null,"","","","",null,null,73,null,null,null,null,null,"",null,null,null,null,null,null,null,null,null,null,null,null,null,null,null,10,"","","","","",null,"","",null,"","",null,"Четвертьфиналы",null,null,null,null,null,null,null,null,null,null,null,null,null,null,null,null,null,"",""]
[null,null,"",null,null,"","","","",null,null,74,null,null,null,null,null,"",null,null,null,null,null,null,null,null,null,null,null,null,null,null,null,11,"","","","","",null,"","",null,"","",null,"Четвёртый круг",null,null,null,null,null,null,null,null,null,null,null,null,null,null,null,null,null,"",""]
[null,null,"",null,null,"","","","",null,null,75,null,null,null,null,null,"",null,null,null,null,null,null,null,null,null,null,null,null,null,null,null,12,"","","","","",null,"","",null,"","",null,"Третий круг",null,null,null,null,null,null,null,null,null,null,null,null,null,null,null,null,null,"",""]
[null,null,"",null,null,"","","","",null,null,76,null,null,null,null,null,"",null,null,null,null,null,null,null,null,null,null,null,null,null,null,null,13,"","","","","",null,"","",null,"","",null,"Второй круг",null,null,null,null,null,null,null,null,null,null,null,null,null,null,null,null,null,"",""]
[null,null,"",null,null,"","","","",null,null,77,null,null,null,null,null,"",null,null,null,null,null,null,null,null,null,null,null,null,null,null,null,14,"","","","","",null,"","",null,"","",null,"Первый круг",null,null,null,null,null,null,null,null,null,null,null,null,null,null,null,null,null,"",""]
[null,null,"",null,null,"","","","",null,null,78,null,null,null,null,null,"",null,null,null,null,null,null,null,null,null,null,null,null,null,null,null,15,"","","","","",null,"","",null,"","",null,null,null,null,null,null,null,null,null,null,null,null,null,null,null,null,null,null,null,"",""]
[null,null,"",null,null,"","","","",null,null,79,null,null,null,null,null,"",null,null,null,null,null,null,null,null,null,null,null,null,null,null,null,16,"","","","","",null,"","",null,"","",null,null,null,null,null,null,null,null,null,null,null,null,null,null,null,null,null,null,null,"",""]
[null,null,"",null,null,"","","","",null,null,80,null,null,null,null,null,"",null,null,null,null,null,null,null,null,null,null,null,null,null,null,null,17,"","","","","",null,"","",null,"","",null,null,null,null,null,null,null,null,null,null,null,null,null,null,null,null,null,null,null,"",""]
[null,null,"",null,null,"","","","",null,null,81,null,null,null,null,null,"",null,null,null,null,null,null,null,null,null,null,null,null,null,null,null,18,"","","","","",null,"","",null,"","",null,null,null,null,null,null,null,null,null,null,null,null,null,null,null,null,null,null,null,"",""]
[null,null,"",null,null,"","","","",null,null,82,null,null,null,null,null,"",null,null,null,null,null,null,null,null,null,null,null,null,null,null,null,19,"","","","","",null,"","",null,"","",null,null,null,null,null,null,null,null,null,null,null,null,null,null,null,null,null,null,null,"",""]
[null,null,"",null,null,"","","","",null,null,83,null,null,null,null,null,"",null,null,null,null,null,null,null,null,null,null,null,null,null,null,null,20,"","","","","",null,"","",null,"","",null,null,null,null,null,null,null,null,null,null,null,null,null,null,null,null,null,null,null,"",""]
[null,null,"",null,null,"","","","",null,null,84,null,null,null,null,null,"",null,null,null,null,null,null,null,null,null,null,null,null,null,null,null,21,"","","","","",null,"","",null,"","",null,null,null,null,null,null,null,null,null,null,null,null,null,null,null,null,null,null,null,"",""]
[null,null,"",null,null,"","","","",null,null,85,null,null,null,null,null,"",null,null,null,null,null,null,null,null,null,null,null,null,null,null,null,22,"","","","","",null,"","",null,"","",null,null,null,null,null,null,null,null,null,null,null,null,null,null,null,null,null,null,null,"",""]
[null,null,"",null,null,"","","","",null,null,86,null,null,null,null,null,"",null,null,null,null,null,null,null,null,null,null,null,null,null,null,null,23,"","","","","",null,"","",null,"","",null,null,null,null,null,null,null,null,null,null,null,null,null,null,null,null,null,null,null,"",""]
[null,null,"",null,null,"","","","",null,null,87,null,null,null,null,null,"",null,null,null,null,null,null,null,null,null,null,null,null,null,null,null,24,"","","","","",null,"","",null,"","",null,null,null,null,null,null,null,null,null,null,null,null,null,null,null,null,null,null,null,"",""]
[null,null,"",null,null,"","","","",null,null,88,null,null,null,null,null,"",null,null,null,null,null,null,null,null,null,null,null,null,null,null,null,25,"","","","","",null,"","",null,"","",null,null,null,null,null,null,null,null,null,null,null,null,null,null,null,null,null,null,null,"",""]
[null,null,"",null,null,"","","","",null,null,89,null,null,null,null,null,"",null,null,null,null,null,null,null,null,null,null,null,null,null,null,null,26,"","","","","",null,"","",null,"","",null,null,null,null,null,null,null,null,null,null,null,null,null,null,null,null,null,null,null,"",""]
[null,null,"",null,null,"","","","",null,null,90,null,null,null,null,null,"",null,null,null,null,null,null,null,null,null,null,null,null,null,null,null,27,"","","","","",null,"","",null,"","",null,null,null,null,null,null,null,null,null,null,null,null,null,null,null,null,null,null,null,"",""]
[null,null,"",null,null,"","","","",null,null,91,null,null,null,null,null,"",null,null,null,null,null,null,null,null,null,null,null,null,null,null,null,28,"","","","","",null,"","",null,"","",null,null,null,null,null,null,null,null,null,null,null,null,null,null,null,null,null,null,null,"",""]
[null,null,"",null,null,"","","","",null,null,92,null,null,null,null,null,"",null,null,null,null,null,null,null,null,null,null,null,null,null,null,null,29,"","","","","",null,"","",null,"","",null,null,null,null,null,null,null,null,null,null,null,null,null,null,null,null,null,null,null,"",""]
[null,null,"",null,null,"","","","",null,null,93,null,null,null,null,null,"",null,null,null,null,null,null,null,null,null,null,null,null,null,null,null,30,"","","","","",null,"","",null,"","",null,null,null,null,null,null,null,null,null,null,null,null,null,null,null,null,null,null,null,"",""]
[null,null,"",null,null,"","","","",null,null,94,null,null,null,null,null,"",null,null,null,null,null,null,null,null,null,null,null,null,null,null,null,31,"","","","","",null,"","",null,"","",null,null,null,null,null,null,null,null,null,null,null,null,null,null,null,null,null,null,null,"",""]
[null,null,"",null,null,"","","","",null,null,95,null,null,null,null,null,"",null,null,null,null,null,null,null,null,null,null,null,null,null,null,null,32,"","","","","",null,"","",null,"","",null,null,null,null,null,null,null,null,null,null,null,null,null,null,null,null,null,null,null,"",""]
[null,null,{"$f":"CHOOSE(VLOOKUP($N$3,$AW$11:$AX$200,2,0),AH106,AH106,\"\",\"\",\"\",\"\",\"\")","v":""},null,null,"","","","",null,null,96,null,null,null,null,null,"",null,null,null,null,null,null,null,null,null,null,null,null,null,null,null,33,"","","","","",null,"","",null,"","",null,null,null,null,null,null,null,null,null,null,null,null,null,null,null,null,null,null,null,"",""]
[null,null,"",null,null,"","","","",null,null,97,null,null,null,null,null,"",null,null,null,null,null,null,null,null,null,null,null,null,null,null,null,34,{"$f":"IF(B107<>\"\",B107,\"\")","v":""},{"$f":"IF(C107<>\"\",C107,\"\")","v":""},{"$f":"IF(AND(D107<>\"\",D107<>\"(Q)\",D107<>\"bye\"),VLOOKUP(D107,$M$11:$R$200,6,0),\"\")","v":""},{"$f":"IF(AND(E107<>\"\",E107<>\"(Q)\",E107<>\"bye\"),VLOOKUP(E107,$M$11:$T$200,6,0),\"\")","v":""},{"$f":"IF(C107=\"\",\"\",IF(C108=\"\",1,IF(B108=\"\",AM108,AM108+1)))","v":""},null,"","",null,"","",null,null,null,null,null,null,null,null,null,null,null,null,null,null,null,null,null,null,null,{"$f":"IF(AND($H107<>\"\",$I107<>\"\"),ROUND(($BN$4*AO107^4+$BN$5*AO107^3+$BN$6*AO107^2+$BN$7*AO107+$BN$8)*2,0)/2,\"\")","v":""},{"$f":"IF(AND($H107<>\"\",$I107<>\"\"),ROUND(($BN$4*AP107^4+$BN$5*AP107^3+$BN$6*AP107^2+$BN$7*AP107+$BN$8)*2,0)/2,\"\")","v":""}]
[null,null,"",null,null,"","","","",null,null,98,null,null,null,null,null,"",null,null,null,null,null,null,null,null,null,null,null,null,null,null,null,35,"","","","","",null,"","",null,"","",null,null,null,null,null,null,null,null,null,null,null,null,null,null,null,null,null,null,null,"",""]
[null,null,"",null,null,"","","","",null,null,99,null,null,null,null,null,"",null,null,null,null,null,null,null,null,null,null,null,null,null,null,null,36,"","","","","",null,"","",null,"","",null,null,null,null,null,null,null,null,null,null,null,null,null,null,null,null,null,null,null,"",""]
[null,null,"",null,null,"","","","",null,null,100,null,null,null,null,null,"",null,null,null,null,null,null,null,null,null,null,null,null,null,null,null,37,"","","","","",null,"","",null,"","",null,null,null,null,null,null,null,null,null,null,null,null,null,null,null,null,null,null,null,"",""]
[null,null,"",null,null,"","","","",null,null,101,null,null,null,null,null,"",null,null,null,null,null,null,null,null,null,null,null,null,null,null,null,38,"","","","","",null,"","",null,"","",null,null,null,null,null,null,null,null,null,null,null,null,null,null,null,null,null,null,null,"",""]
[null,null,"",null,null,"","","","",null,null,102,null,null,null,null,null,"",null,null,null,null,null,null,null,null,null,null,null,null,null,null,null,39,"","","","","",null,"","",null,"","",null,null,null,null,null,null,null,null,null,null,null,null,null,null,null,null,null,null,null,"",""]
[null,null,"",null,null,"","","","",null,null,103,null,null,null,null,null,"",null,null,null,null,null,null,null,null,null,null,null,null,null,null,null,40,"","","","","",null,"","",null,"","",null,null,null,null,null,null,null,null,null,null,null,null,null,null,null,null,null,null,null,"",""]
[null,null,"",null,null,"","","","",null,null,104,null,null,null,null,null,"",null,null,null,null,null,null,null,null,null,null,null,null,null,null,null,41,"","","","","",null,"","",null,"","",null,null,null,null,null,null,null,null,null,null,null,null,null,null,null,null,null,null,null,"",""]
[null,null,"",null,null,"","","","",null,null,105,null,null,null,null,null,"",null,null,null,null,null,null,null,null,null,null,null,null,null,null,null,42,"","","","","",null,"","",null,"","",null,null,null,null,null,null,null,null,null,null,null,null,null,null,null,null,null,null,null,"",""]
[null,null,"",null,null,"","","","",null,null,106,null,null,null,null,null,"",null,null,null,null,null,null,null,null,null,null,null,null,null,null,null,43,"","","","","",null,"","",null,"","",null,null,null,null,null,null,null,null,null,null,null,null,null,null,null,null,null,null,null,"",""]
[null,null,"",null,null,"","","","",null,null,107,null,null,null,null,null,"",null,null,null,null,null,null,null,null,null,null,null,null,null,null,null,44,"","","","","",null,"","",null,"","",null,null,null,null,null,null,null,null,null,null,null,null,null,null,null,null,null,null,null,"",""]
[null,null,"",null,null,"","","","",null,null,108,null,null,null,null,null,"",null,null,null,null,null,null,null,null,null,null,null,null,null,null,null,45,"","","","","",null,"","",null,"","",null,null,null,null,null,null,null,null,null,null,null,null,null,null,null,null,null,null,null,"",""]
[null,null,"",null,null,"","","","",null,null,109,null,null,null,null,null,"",null,null,null,null,null,null,null,null,null,null,null,null,null,null,null,46,"","","","","",null,"","",null,"","",null,null,null,null,null,null,null,null,null,null,null,null,null,null,null,null,null,null,null,"",""]
[null,null,"",null,null,"","","","",null,null,110,null,null,null,null,null,"",null,null,null,null,null,null,null,null,null,null,null,null,null,null,null,47,"","","","","",null,"","",null,"","",null,null,null,null,null,null,null,null,null,null,null,null,null,null,null,null,null,null,null,"",""]
[null,null,"",null,null,"","","","",null,null,111,null,null,null,null,null,"",null,null,null,null,null,null,null,null,null,null,null,null,null,null,null,48,"","","","","",null,"","",null,"","",null,null,null,null,null,null,null,null,null,null,null,null,null,null,null,null,null,null,null,"",""]
[null,null,"",null,null,"","","","",null,null,112,null,null,null,null,null,"",null,null,null,null,null,null,null,null,null,null,null,null,null,null,null,49,"","","","","",null,"","",null,"","",null,null,null,null,null,null,null,null,null,null,null,null,null,null,null,null,null,null,null,"",""]
[null,null,"",null,null,"","","","",null,null,113,null,null,null,null,null,"",null,null,null,null,null,null,null,null,null,null,null,null,null,null,null,50,"","","","","",null,"","",null,"","",null,null,null,null,null,null,null,null,null,null,null,null,null,null,null,null,null,null,null,"",""]
[null,null,"",null,null,"","","","",null,null,114,null,null,null,null,null,"",null,null,null,null,null,null,null,null,null,null,null,null,null,null,null,51,"","","","","",null,"","",null,"","",null,null,null,null,null,null,null,null,null,null,null,null,null,null,null,null,null,null,null,"",""]
[null,null,"",null,null,"","","","",null,null,115,null,null,null,null,null,"",null,null,null,null,null,null,null,null,null,null,null,null,null,null,null,52,"","","","","",null,"","",null,"","",null,null,null,null,null,null,null,null,null,null,null,null,null,null,null,null,null,null,null,"",""]
[null,null,"",null,null,"","","","",null,null,116,null,null,null,null,null,"",null,null,null,null,null,null,null,null,null,null,null,null,null,null,null,53,"","","","","",null,"","",null,"","",null,null,null,null,null,null,null,null,null,null,null,null,null,null,null,null,null,null,null,"",""]
[null,null,"",null,null,"","","","",null,null,117,null,null,null,null,null,"",null,null,null,null,null,null,null,null,null,null,null,null,null,null,null,54,"","","","","",null,"","",null,"","",null,null,null,null,null,null,null,null,null,null,null,null,null,null,null,null,null,null,null,"",""]
[null,null,"",null,null,"","","","",null,null,118,null,null,null,null,null,"",null,null,null,null,null,null,null,null,null,null,null,null,null,null,null,55,"","","","","",null,"","",null,"","",null,null,null,null,null,null,null,null,null,null,null,null,null,null,null,null,null,null,null,"",""]
[null,null,"",null,null,"","","","",null,null,119,null,null,null,null,null,"",null,null,null,null,null,null,null,null,null,null,null,null,null,null,null,56,"","","","","",null,"","",null,"","",null,null,null,null,null,null,null,null,null,null,null,null,null,null,null,null,null,null,null,"",""]
[null,null,"",null,null,"","","","",null,null,120,null,null,null,null,null,"",null,null,null,null,null,null,null,null,null,null,null,null,null,null,null,57,"","","","","",null,"","",null,"","",null,null,null,null,null,null,null,null,null,null,null,null,null,null,null,null,null,null,null,"",""]
[null,null,"",null,null,"","","","",null,null,121,null,null,null,null,null,"",null,null,null,null,null,null,null,null,null,null,null,null,null,null,null,58,"","","","","",null,{"$f":"IF(AND($H131<>\"\",$I131<>\"\"),0.5-IF(H131<=I131,-1,1)*MIN(AS131,9.99)/20,\"\")","v":""},{"$f":"IF(AND($H131<>\"\",$I131<>\"\"),0.5-IF(H131>I131,-1,1)*MIN(AS131,9.99)/20,\"\")","v":""},null,"","",null,null,null,null,null,null,null,null,null,null,null,null,null,null,null,null,null,null,null,"",""]
[null,null,"",null,null,"","","","",null,null,122,null,null,null,null,null,"",null,null,null,null,null,null,null,null,null,null,null,null,null,null,null,59,"","","","","",null,"","",null,"","",null,null,null,null,null,null,null,null,null,null,null,null,null,null,null,null,null,null,null,"",""]
[null,null,"",null,null,"","","","",null,null,123,null,null,null,null,null,"",null,null,null,null,null,null,null,null,null,null,null,null,null,null,null,60,"","","","","",null,"","",null,"","",null,null,null,null,null,null,null,null,null,null,null,null,null,null,null,null,null,null,null,"",""]
[null,null,"",null,null,"","","","",null,null,124,null,null,null,null,null,"",null,null,null,null,null,null,null,null,null,null,null,null,null,null,null,61,"","","","","",null,"","",null,"","",null,null,null,null,null,null,null,null,null,null,null,null,null,null,null,null,null,null,null,"",""]
[null,null,"",null,null,"","","","",null,null,125,null,null,null,null,null,"",null,null,null,null,null,null,null,null,null,null,null,null,null,null,null,62,"","","","","",null,"","",null,"","",null,null,null,null,null,null,null,null,null,null,null,null,null,null,null,null,null,null,null,"",""]
[null,null,"",null,null,"","","","",null,null,126,null,null,null,null,null,"",null,null,null,null,null,null,null,null,null,null,null,null,null,null,null,63,"","","","","",null,"","",null,"","",null,null,null,null,null,null,null,null,null,null,null,null,null,null,null,null,null,null,null,"",""]
[null,null,"",null,null,"","","","",null,null,127,null,null,null,null,null,"",null,null,null,null,null,null,null,null,null,null,null,null,null,null,null,64,"","","","","",null,"","",null,"","",null,null,null,null,null,null,null,null,null,null,null,null,null,null,null,null,null,null,null,"",""]
[null,null,{"$f":"CHOOSE(VLOOKUP($N$3,$AW$11:$AX$200,2,0),\"\",\"\",\"\",\"\",\"\",\"\",\"\")","v":""},null,null,{"$f":"IF(AND($H138<>\"\",$I138<>\"\"),ROUND((10+IF(H138<=I138,-1,1)*MIN(AS138,9.5))*2,0)/2,\"\")","v":""},{"$f":"IF(AND($H138<>\"\",$I138<>\"\"),ROUND((10+IF(H138>I138,-1,1)*MIN(AS138,9.5))*2,0)/2,\"\")","v":""},{"$f":"IF(AK138<>\"\",MAX(1/((AK138+$AJ$8)^(-$AJ$7)+VLOOKUP($AM138,$AU$3:$AV$9,2,0)/$AJ$6)^(1/$AJ$7)-$AJ$8,MIN(AK138,$AM$8)),\"\")","v":""},{"$f":"IF(AL138<>\"\",MAX(1/((AL138+$AJ$8)^(-$AJ$7)+VLOOKUP($AM138,$AU$3:$AV$9,2,0)/$AJ$6)^(1/$AJ$7)-$AJ$8,MIN(AL138,$AM$8)),\"\")","v":""},null,null,128,null,null,null,null,null,"",null,null,null,null,null,null,null,null,null,null,null,null,null,null,null,null,"","","","",null,null,"","",null,"","",null,null,null,null,null,null,null,null,null,null,null,null,null,null,null,null,null,null,null,"",""]
[null,null,"",null,null,"","","","",null,null,null,null,null,null,null,null,"",null,null,null,null,null,null,null,null,null,null,null,null,null,null,null,null,{"$f":"IF(B139<>\"\",B139,\"\")","v":""},{"$f":"IF(C139<>\"\",C139,\"\")","v":""},{"$f":"IF(AND(D139<>\"\",D139<>\"(Q)\",D139<>\"bye\"),VLOOKUP(D139,$M$11:$R$200,6,0),\"\")","v":""},{"$f":"IF(AND(E139<>\"\",E139<>\"(Q)\",E139<>\"bye\"),VLOOKUP(E139,$M$11:$T$200,6,0),\"\")","v":""},{"$f":"IF(C139=\"\",\"\",IF(C140=\"\",1,IF(B139=\"\",AM140,AM140+1)))","v":""},null,"","",null,"","",null,null,null,null,null,null,null,null,null,null,null,null,null,null,null,null,null,null,null,{"$f":"IF(AND($H139<>\"\",$I139<>\"\"),ROUND(($BN$4*AO139^4+$BN$5*AO139^3+$BN$6*AO139^2+$BN$7*AO139+$BN$8)*2,0)/2,\"\")","v":""},{"$f":"IF(AND($H139<>\"\",$I139<>\"\"),ROUND(($BN$4*AP139^4+$BN$5*AP139^3+$BN$6*AP139^2+$BN$7*AP139+$BN$8)*2,0)/2,\"\")","v":""}]
[null,null,"",null,null,"","","","",null,null,null,null,null,null,null,null,{"$f":"IF(N140<>\"\",SUM(N140,P140),\"\")","v":""},null,null,null,null,null,null,null,null,null,null,null,null,null,null,null,null,"","","","",{"$f":"IF(C140=\"\",\"\",IF(C141=\"\",1,IF(B140=\"\",AM141,AM141+1)))","v":""},null,"","",null,{"$f":"IF(AND($H140<>\"\",$I140<>\"\"),LOG(MAX(H140,I140)/MIN(H140,I140),MIN($AJ$2/MIN(H140,I140)^$AJ$3+$AJ$4,$AJ$2+$AJ$4)),\"\")","v":""},{"$f":"IF(AR140<>\"\",IF(AR140<=$AS$6,AR140,(AR140-$AS$6+$AS$7^(1-$AS$7))^$AS$7+$AS$6-$AS$7^($AS$7*(1-$AS$7))),\"\")","v":""},null,null,null,null,null,null,null,null,null,null,null,null,null,null,null,null,null,null,null,"",""]
[null,null,"",null,null,"","","","",null,null,null,null,null,null,null,null,"",null,null,null,null,null,null,null,null,null,null,null,null,null,null,null,null,"","","","",{"$f":"IF(C141=\"\",\"\",IF(C142=\"\",1,IF(B141=\"\",AM142,AM142+1)))","v":""},null,"","",null,"","",null,null,null,null,null,null,null,null,null,null,null,null,null,null,null,null,null,null,null,"",""]
[null,null,"",null,null,"","","","",null,null,null,null,null,null,null,null,"",null,null,null,null,null,null,null,null,null,null,null,null,null,null,null,null,"","","","",{"$f":"IF(C142=\"\",\"\",IF(C143=\"\",1,IF(B142=\"\",AM143,AM143+1)))","v":""},null,"","",null,"","",null,null,null,null,null,null,null,null,null,null,null,null,null,null,null,null,null,null,null,"",""]
[null,null,"",null,null,"","","","",null,null,null,null,null,null,null,null,"",null,null,null,null,null,null,null,null,null,null,null,null,null,null,null,null,"","","","",{"$f":"IF(C143=\"\",\"\",IF(C144=\"\",1,IF(B143=\"\",AM144,AM144+1)))","v":""},null,"","",null,"","",null,null,null,null,null,null,null,null,null,null,null,null,null,null,null,null,null,null,null,"",""]
[null,null,"",null,null,"","","","",null,null,null,null,null,null,null,null,"",null,null,null,null,null,null,null,null,null,null,null,null,null,null,null,null,"","","","",null,null,"","",null,"","",null,null,null,null,null,null,null,null,null,null,null,null,null,null,null,null,null,null,null,"",""]
[null,null,"",null,null,"","","","",null,null,null,null,null,null,null,null,"",null,null,null,null,null,null,null,null,null,null,null,null,null,null,null,null,"","","","",null,null,"","",null,"","",null,null,null,null,null,null,null,null,null,null,null,null,null,null,null,null,null,null,null,"",""]
[null,null,"",null,null,"","","","",null,null,null,null,null,null,null,null,"",null,null,null,null,null,null,null,null,null,null,null,null,null,null,null,null,"","","","",null,null,"","",null,"","",null,null,null,null,null,null,null,null,null,null,null,null,null,null,null,null,null,null,null,"",""]
[null,null,"",null,null,"","","","",null,null,null,null,null,null,null,null,"",null,null,null,null,null,null,null,null,null,null,null,null,null,null,null,null,"","","","",null,null,"","",null,"","",null,null,null,null,null,null,null,null,null,null,null,null,null,null,null,null,null,null,null,"",""]
[null,null,"",null,null,"","","","",null,null,null,null,null,null,null,null,"",null,null,null,null,null,null,null,null,null,null,null,null,null,null,null,null,"","","","",null,null,"","",null,"","",null,null,null,null,null,null,null,null,null,null,null,null,null,null,null,null,null,null,null,"",""]
[null,null,"",null,null,"","","","",null,null,null,null,null,null,null,null,"",null,null,null,null,null,null,null,null,null,null,null,null,null,null,null,null,"","","","",null,null,"","",null,"","",null,null,null,null,null,null,null,null,null,null,null,null,null,null,null,null,null,null,null,"",""]
[null,null,"",null,null,"","","","",null,null,null,null,null,null,null,null,"",null,null,null,null,null,null,null,null,null,null,null,null,null,null,null,null,"","","","",null,null,"","",null,"","",null,null,null,null,null,null,null,null,null,null,null,null,null,null,null,null,null,null,null,"",""]
[null,null,"",null,null,"","","","",null,null,null,null,null,null,null,null,"",null,null,null,null,null,null,null,null,null,null,null,null,null,null,null,null,"","","","",null,null,"","",null,"","",null,null,null,null,null,null,null,null,null,null,null,null,null,null,null,null,null,null,null,"",""]
[null,null,"",null,null,"","","","",null,null,null,null,null,null,null,null,"",null,null,null,null,null,null,null,null,null,null,null,null,null,null,null,null,"","","","",null,null,"","",null,"","",null,null,null,null,null,null,null,null,null,null,null,null,null,null,null,null,null,null,null,"",""]
[null,null,"",null,null,"","","","",null,null,null,null,null,null,null,null,"",null,null,null,null,null,null,null,null,null,null,null,null,null,null,null,null,"","","","",null,null,"","",null,"","",null,null,null,null,null,null,null,null,null,null,null,null,null,null,null,null,null,null,null,"",""]
[null,null,"",null,null,"","","","",null,null,null,null,null,null,null,null,"",null,null,null,null,null,null,null,null,null,null,null,null,null,null,null,null,"","","","",null,null,"","",null,"","",null,null,null,null,null,null,null,null,null,null,null,null,null,null,null,null,null,null,null,"",""]
[null,null,"",null,null,"","","","",null,null,null,null,null,null,null,null,"",null,null,null,null,null,null,null,null,null,null,null,null,null,null,null,null,"","","","",null,null,"","",null,"","",null,null,null,null,null,null,null,null,null,null,null,null,null,null,null,null,null,null,null,"",""]
[null,null,"",null,null,"","","","",null,null,null,null,null,null,null,null,"",null,null,null,null,null,null,null,null,null,null,null,null,null,null,null,null,"","","","",null,null,"","",null,"","",null,null,null,null,null,null,null,null,null,null,null,null,null,null,null,null,null,null,null,"",""]
[null,null,"",null,null,"","","","",null,null,null,null,null,null,null,null,"",null,null,null,null,null,null,null,null,null,null,null,null,null,null,null,null,"","","","",null,null,"","",null,"","",null,null,null,null,null,null,null,null,null,null,null,null,null,null,null,null,null,null,null,"",""]
[null,null,"",null,null,"","","","",null,null,null,null,null,null,null,null,"",null,null,null,null,null,null,null,null,null,null,null,null,null,null,null,null,"","","","",null,null,"","",null,"","",null,null,null,null,null,null,null,null,null,null,null,null,null,null,null,null,null,null,null,"",""]
[null,null,"",null,null,"","","","",null,null,null,null,null,null,null,null,{"$f":"IF(N140<>\"\",SUM(N140,P159),\"\")","v":""},null,null,null,null,null,null,null,null,null,null,null,null,null,null,null,null,"","","","",null,null,"","",null,"","",null,null,null,null,null,null,null,null,null,null,null,null,null,null,null,null,null,null,null,"",""]
[null,null,"",null,null,"","","","",null,null,null,null,null,null,null,null,"",null,null,null,null,null,null,null,null,null,null,null,null,null,null,null,null,"","","","",null,null,"","",null,"","",null,null,null,null,null,null,null,null,null,null,null,null,null,null,null,null,null,null,null,"",""]
[null,null,"",null,null,"","","","",null,null,null,null,null,null,null,null,"",null,null,null,null,null,null,null,null,null,null,null,null,null,null,null,null,"","","","",null,null,"","",null,"","",null,null,null,null,null,null,null,null,null,null,null,null,null,null,null,null,null,null,null,"",""]
[null,null,"",null,null,"","","","",null,null,null,null,null,null,null,null,"",null,null,null,null,null,null,null,null,null,null,null,null,null,null,null,null,"","","","",null,null,"","",null,"","",null,null,null,null,null,null,null,null,null,null,null,null,null,null,null,null,null,null,null,"",""]
[null,null,"",null,null,"","","","",null,null,null,null,null,null,null,null,"",null,null,null,null,null,null,null,null,null,null,null,null,null,null,null,null,"","","","",null,null,"","",null,"","",null,null,null,null,null,null,null,null,null,null,null,null,null,null,null,null,null,null,null,"",""]
[null,null,"",null,null,"","","","",null,null,null,null,null,null,null,null,"",null,null,null,null,null,null,null,null,null,null,null,null,null,null,null,null,"","","","",null,null,"","",null,"","",null,null,null,null,null,null,null,null,null,null,null,null,null,null,null,null,null,null,null,"",""]
[null,null,"",null,null,"","","","",null,null,null,null,null,null,null,null,"",null,null,null,null,null,null,null,null,null,null,null,null,null,null,null,null,"","","","",null,null,"","",null,"","",null,null,null,null,null,null,null,null,null,null,null,null,null,null,null,null,null,null,null,"",""]
[null,null,"",null,null,"","",{"$f":"IF(AK166<>\"\",MAX(1/((AK166+$AJ$8)^(-$AJ$7)+VLOOKUP($AM166,$AU$3:$AV$9,2,0)/$AJ$6)^(1/$AJ$7)-$AJ$8,MIN(AK166,$AM$8)),\"\")","v":""},{"$f":"IF(AL166<>\"\",MAX(1/((AL166+$AJ$8)^(-$AJ$7)+VLOOKUP($AM166,$AU$3:$AV$9,2,0)/$AJ$6)^(1/$AJ$7)-$AJ$8,MIN(AL166,$AM$8)),\"\")","v":""},null,null,null,null,null,null,null,null,"",null,null,null,null,null,null,null,null,null,null,null,null,null,null,null,null,"","","","",null,null,"","",null,"","",null,null,null,null,null,null,null,null,null,null,null,null,null,null,null,null,null,null,null,"",""]
[null,null,"",null,null,"","","","",null,null,null,null,null,null,null,null,"",null,null,null,null,null,null,null,null,null,null,null,null,null,null,null,null,"","","","",null,null,"","",null,"","",null,null,null,null,null,null,null,null,null,null,null,null,null,null,null,null,null,null,null,"",""]
[null,null,"",null,null,"","","","",null,null,null,null,null,null,null,null,"",null,null,null,null,null,null,null,null,null,null,null,null,null,null,null,null,"","","","",null,null,"","",null,"","",null,null,null,null,null,null,null,null,null,null,null,null,null,null,null,null,null,null,null,"",""]
[null,null,"",null,null,"","","","",null,null,null,null,null,null,null,null,"",null,null,null,null,null,null,null,null,null,null,null,null,null,null,null,null,"","","","",null,null,"","",null,"","",null,null,null,null,null,null,null,null,null,null,null,null,null,null,null,null,null,null,null,"",""]
[null,null,{"$f":"CHOOSE(VLOOKUP($N$3,$AW$11:$AX$200,2,0),\"\",\"\",\"\",\"\",\"\",\"\",\"\")","v":""},null,null,"","","","",null,null,null,null,null,null,null,null,{"$f":"IF(N151<>\"\",SUM(N151,P170),\"\")","v":""},null,null,null,null,null,null,null,null,null,null,null,null,null,null,null,null,"","","","",null,null,"","",null,"","",null,null,null,null,null,null,null,null,null,null,null,null,null,null,null,null,null,null,null,"",""]
[null,null,"",null,null,"","","","",null,null,null,null,null,null,null,null,"",null,null,null,null,null,null,null,null,null,null,null,null,null,null,null,null,{"$f":"IF(B171<>\"\",B171,\"\")","v":""},{"$f":"IF(C171<>\"\",C171,\"\")","v":""},{"$f":"IF(AND(D171<>\"\",D171<>\"(Q)\",D171<>\"bye\"),VLOOKUP(D171,$M$11:$R$200,6,0),\"\")","v":""},{"$f":"IF(AND(E171<>\"\",E171<>\"(Q)\",E171<>\"bye\"),VLOOKUP(E171,$M$11:$T$200,6,0),\"\")","v":""},null,null,"","",null,"","",null,null,null,null,null,null,null,null,null,null,null,null,null,null,null,null,null,null,null,{"$f":"IF(AND($H171<>\"\",$I171<>\"\"),ROUND(($BN$4*AO171^4+$BN$5*AO171^3+$BN$6*AO171^2+$BN$7*AO171+$BN$8)*2,0)/2,\"\")","v":""},{"$f":"IF(AND($H171<>\"\",$I171<>\"\"),ROUND(($BN$4*AP171^4+$BN$5*AP171^3+$BN$6*AP171^2+$BN$7*AP171+$BN$8)*2,0)/2,\"\")","v":""}]
[null,null,"",null,null,"","","","",null,null,null,null,null,null,null,null,"",null,null,null,null,null,null,null,null,null,null,null,null,null,null,null,null,"","","","",null,null,"","",null,"","",null,null,null,null,null,null,null,null,null,null,null,null,null,null,null,null,null,null,null,"",""]
[null,null,"",null,null,"","","","",null,null,null,null,null,null,null,null,"",null,null,null,null,null,null,null,null,null,null,null,null,null,null,null,null,"","","","",null,null,"","",null,"","",null,null,null,null,null,null,null,null,null,null,null,null,null,null,null,null,null,null,null,"",""]
[null,null,"",null,null,"","","","",null,null,null,null,null,null,null,null,"",null,null,null,null,null,null,null,null,null,null,null,null,null,null,null,null,"","","","",null,null,"","",null,"","",null,null,null,null,null,null,null,null,null,null,null,null,null,null,null,null,null,null,null,"",""]
[null,null,"",null,null,{"$f":"IF(AND($H175<>\"\",$I175<>\"\"),ROUND((10+IF(H175<=I175,-1,1)*MIN(AS175,9.5))*2,0)/2,\"\")","v":""},{"$f":"IF(AND($H175<>\"\",$I175<>\"\"),ROUND((10+IF(H175>I175,-1,1)*MIN(AS175,9.5))*2,0)/2,\"\")","v":""},"","",null,null,null,null,null,null,null,null,"",null,null,null,null,null,null,null,null,null,null,null,null,null,null,null,null,"","","","",null,null,"","",null,"","",null,null,null,null,null,null,null,null,null,null,null,null,null,null,null,null,null,null,null,"",""]
[null,null,"",null,null,"","","","",null,null,null,null,null,null,null,null,"",null,null,null,null,null,null,null,null,null,null,null,null,null,null,null,null,"","","","",null,null,"","",null,"","",null,null,null,null,null,null,null,null,null,null,null,null,null,null,null,null,null,null,null,"",""]
[null,null,"",null,null,"","","","",null,null,null,null,null,null,null,null,"",null,null,null,null,null,null,null,null,null,null,null,null,null,null,null,null,"","","","",null,null,"","",null,"","",null,null,null,null,null,null,null,null,null,null,null,null,null,null,null,null,null,null,null,"",""]
[null,null,"",null,null,"","","","",null,null,null,null,null,null,null,null,"",null,null,null,null,null,null,null,null,null,null,null,null,null,null,null,null,"","","","",null,null,"","",null,"","",null,null,null,null,null,null,null,null,null,null,null,null,null,null,null,null,null,null,null,"",""]
[null,null,"",null,null,"","","","",null,null,null,null,null,null,null,null,"",null,null,null,null,null,null,null,null,null,null,null,null,null,null,null,null,"","","","",null,null,"","",null,"","",null,null,null,null,null,null,null,null,null,null,null,null,null,null,null,null,null,null,null,"",""]
[null,null,"",null,null,"","","","",null,null,null,null,null,null,null,null,"",null,null,null,null,null,null,null,null,null,null,null,null,null,null,null,null,"","","","",null,null,"","",null,"","",null,null,null,null,null,null,null,null,null,null,null,null,null,null,null,null,null,null,null,"",""]
[null,null,"",null,null,"","","","",null,null,null,null,null,null,null,null,"",null,null,null,null,null,null,null,null,null,null,null,null,null,null,null,null,"","","","",null,null,"","",null,"","",null,null,null,null,null,null,null,null,null,null,null,null,null,null,null,null,null,null,null,"",""]
[null,null,"",null,null,"","","","",null,null,null,null,null,null,null,null,"",null,null,null,null,null,null,null,null,null,null,null,null,null,null,null,null,"","","","",null,null,"","",null,"","",null,null,null,null,null,null,null,null,null,null,null,null,null,null,null,null,null,null,null,"",""]
[null,null,"",null,null,"","","","",null,null,null,null,null,null,null,null,"",null,null,null,null,null,null,null,null,null,null,null,null,null,null,null,null,"","","","",null,null,"","",null,"","",null,null,null,null,null,null,null,null,null,null,null,null,null,null,null,null,null,null,null,"",""]
[null,null,"",null,null,"","","","",null,null,null,null,null,null,null,null,"",null,null,null,null,null,null,null,null,null,null,null,null,null,null,null,null,"","","","",null,null,"","",null,"","",null,null,null,null,null,null,null,null,null,null,null,null,null,null,null,null,null,null,null,"",""]
[null,null,"",null,null,"","","","",null,null,null,null,null,null,null,null,"",null,null,null,null,null,null,null,null,null,null,null,null,null,null,null,null,"","","","",null,null,"","",null,"","",null,null,null,null,null,null,null,null,null,null,null,null,null,null,null,null,null,null,null,"",""]
[null,null,"",null,null,"","","","",null,null,null,null,null,null,null,null,"",null,null,null,null,null,null,null,null,null,null,null,null,null,null,null,null,"","","","",null,null,"","",null,"","",null,null,null,null,null,null,null,null,null,null,null,null,null,null,null,null,null,null,null,"",""]
[null,null,"",null,null,"","","","",null,null,null,null,null,null,null,null,"",null,null,null,null,null,null,null,null,null,null,null,null,null,null,null,null,"","","","",null,null,"","",null,"","",null,null,null,null,null,null,null,null,null,null,null,null,null,null,null,null,null,null,null,"",""]
[null,null,"",null,null,"","","","",null,null,null,null,null,null,null,null,"",null,null,null,null,null,null,null,null,null,null,null,null,null,null,null,null,"","","","",null,null,"","",null,"","",null,null,null,null,null,null,null,null,null,null,null,null,null,null,null,null,null,null,null,"",""]
[null,null,"",null,null,"","","","",null,null,null,null,null,null,null,null,"",null,null,null,null,null,null,null,null,null,null,null,null,null,null,null,null,"","","","",null,null,"","",null,"","",null,null,null,null,null,null,null,null,null,null,null,null,null,null,null,null,null,null,null,"",""]
[null,null,"",null,null,"","","","",null,null,null,null,null,null,null,null,"",null,null,null,null,null,null,null,null,null,null,null,null,null,null,null,null,"","","","",null,null,"","",null,"","",null,null,null,null,null,null,null,null,null,null,null,null,null,null,null,null,null,null,null,"",""]
[null,null,"",null,null,"","","","",null,null,null,null,null,null,null,null,"",null,null,null,null,null,null,null,null,null,null,null,null,null,null,null,null,"","","","",null,null,"","",null,"","",null,null,null,null,null,null,null,null,null,null,null,null,null,null,null,null,null,null,null,"",""]
[null,null,"",null,null,"","","","",null,null,null,null,null,null,null,null,"",null,null,null,null,null,null,null,null,null,null,null,null,null,null,null,null,"","","","",null,null,"","",null,"","",null,null,null,null,null,null,null,null,null,null,null,null,null,null,null,null,null,null,null,"",""]
[null,null,"",null,null,"","","","",null,null,null,null,null,null,null,null,"",null,null,null,null,null,null,null,null,null,null,null,null,null,null,null,null,"","","","",null,null,"","",null,"","",null,null,null,null,null,null,null,null,null,null,null,null,null,null,null,null,null,null,null,"",""]
[null,null,"",null,null,"","","","",null,null,null,null,null,null,null,null,"",null,null,null,null,null,null,null,null,null,null,null,null,null,null,null,null,"","","","",null,null,"","",null,"","",null,null,null,null,null,null,null,null,null,null,null,null,null,null,null,null,null,null,null,"",""]
[null,null,"",null,null,"","","","",null,null,null,null,null,null,null,null,"",null,null,null,null,null,null,null,null,null,null,null,null,null,null,null,null,"","","","",null,null,{"$f":"IF(AND($H195<>\"\",$I195<>\"\"),0.5-IF(H195<=I195,-1,1)*MIN(AS195,9.99)/20,\"\")","v":""},{"$f":"IF(AND($H195<>\"\",$I195<>\"\"),0.5-IF(H195>I195,-1,1)*MIN(AS195,9.99)/20,\"\")","v":""},null,"","",null,null,null,null,null,null,null,null,null,null,null,null,null,null,null,null,null,null,null,"",""]
[null,null,"",null,null,"","","","",null,null,null,null,null,null,null,null,"",null,null,null,null,null,null,null,null,null,null,null,null,null,null,null,null,"","","","",null,null,"","",null,"","",null,null,null,null,null,null,null,null,null,null,null,null,null,null,null,null,null,null,null,"",""]
[null,null,"",null,null,"","","","",null,null,null,null,null,null,null,null,"",null,null,null,null,null,null,null,null,null,null,null,null,null,null,null,null,"","","","",null,null,"","",null,"","",null,null,null,null,null,null,null,null,null,null,null,null,null,null,null,null,null,null,null,"",""]
[null,null,"",null,null,"","","","",null,null,null,null,null,null,null,null,"",null,null,null,null,null,null,null,null,null,null,null,null,null,null,null,null,"","","","",null,null,"","",null,"","",null,null,null,null,null,null,null,null,null,null,null,null,null,null,null,null,null,null,null,"",""]
[null,null,"",null,null,"","","","",null,null,null,null,null,null,null,null,"",null,null,null,null,null,null,null,null,null,null,null,null,null,null,null,null,"","","","",null,null,"","",null,"","",null,null,null,null,null,null,null,null,null,null,null,null,null,null,null,null,null,null,null,"",""]
[null,null,"",null,null,"","","","",null,null,null,null,null,null,null,null,"",null,null,null,null,null,null,null,null,null,null,null,null,null,null,null,null,"","","","",null,null,"","",null,"","",null,null,null,null,null,null,null,null,null,null,null,null,null,null,null,null,null,null,null,"",""]

{"sheet":"(для форума)","index":1,"n_rows":201,"n_cols":41,"rows_kept":201,"cut":false,"hidden":false,"merged":[]}
[]
[null,null,"Для модератора: перед турниром вручную заполняются столбцы \"Теги\" и \"Постфикс\", остальные формируются автоматически"]
[]
[]
[]
[]
[]
[]
[]
[null,null,"Круги",null,"Матчи",null,null,null,null,"Победители",null,null,"Теги",null,null,null,"Имя","Постфикс",null,null,null,null,null,null,null,null,null,null,null,null,null,null,null,null,null,null,null,null,{"$f":"IF(Коэффициенты!D10<>\"\",Коэффициенты!D10,\"\")","v":"Имя 1"},{"$f":"IF(Коэффициенты!E10<>\"\",Коэффициенты!E10,\"\")","v":"Имя 2"}]
[null,{"$f":"IF(Коэффициенты!B11<>\"\",Коэффициенты!B11,\"\")","v":"Финал"},{"$f":"IF(B11<>\"\",CONCATENATE($M$20,B11,$M$21),\"\")","v":"[size=11][color=#00BFFF][b]Финал[/b][/color][/size]"},{"$f":"IF(Коэффициенты!C11<>\"\",Коэффициенты!C11,\"\")","v":1},{"$f":"IF(AND(AM11<>\"\",AN11<>\"\"),IF(OR(AM11<>\"\",AN11<>\"\"),IF(AN11=\"bye\",CONCATENATE($M$16,AM11,IF(AND(AM11<>\"\",AM11<>\"(Q)\"),VLOOKUP(AM11,$Q$11:$R$200,2,0),\"\"),\"..... vs \",AN11,$M$17),CONCATENATE(IF(J11=\"\",$M$12,\"\"),IF(AM11=J11,\"[b]\",\"\"),AM11,IF(AND(AM11<>\"\",AM11<>\"(Q)\"),VLOOKUP(AM11,$Q$11:$R$200,2,0),\"\"),IF(AM11=J11,\"[/b]\",\"\"),\"..... vs \",IF(AN11=J11,\"[b]\",\"\"),AN11,IF(AND(AN11<>\"\",AN11<>\"(Q)\"),VLOOKUP(AN11,$Q$11:$R$200,2,0),\"\"),IF(AN11=J11,\"[/b]\",\"\"),\"..... ( \",IF(AM11=J11,\"[b]\",\"\"),Коэффициенты!F11,IF(AM11=J11,\"[/b]\",\"\"),\" - \",IF(AN11=J11,\"[b]\",\"\"),Коэффициенты!G11,IF(AN11=J11,\"[/b]\",\"\"),\" )\",IF(J11=\"\",$M$13,\"\"))),\"\"),\"\")","v":{"$error":"#N/A"}},null,null,null,null,null,null,null,"для ставок",null,null,{"$f":"IF(Коэффициенты!L11<>\"\",Коэффициенты!L11,\"\")","v":1},{"$f":"IF(Коэффициенты!M11<>\"\",Коэффициенты!M11,\"\")","v":"R. Federer"},null,null,null,null,null,null,null,null,null,null,null,null,null,null,null,null,null,null,null,null,null,{"$f":"IF(Коэффициенты!D11<>\"\",Коэффициенты!D11,\"\")","v":0},{"$f":"IF(Коэффициенты!E11<>\"\",Коэффициенты!E11,\"\")","v":0},{"$f":"IF(AND(AM11<>\"\",AN11<>\"\"),\"…\",\"\")","v":"…"}]
[null,{"$f":"IF(Коэффициенты!B12<>\"\",Коэффициенты!B12,\"\")","v":"Полуфиналы"},"[size=11][color=#00BFFF][b]Полуфиналы[/b][/color][/size]",{"$f":"IF(Коэффициенты!C12<>\"\",Коэффициенты!C12,\"\")","v":1},{"$f":"IF(AND(AM12<>\"\",AN12<>\"\"),IF(OR(AM12<>\"\",AN12<>\"\"),IF(AN12=\"bye\",CONCATENATE($M$16,AM12,IF(AND(AM12<>\"\",AM12<>\"(Q)\"),VLOOKUP(AM12,$Q$11:$R$200,2,0),\"\"),\"..... vs \",AN12,$M$17),CONCATENATE(IF(J12=\"\",$M$12,\"\"),IF(AM12=J12,\"[b]\",\"\"),AM12,IF(AND(AM12<>\"\",AM12<>\"(Q)\"),VLOOKUP(AM12,$Q$11:$R$200,2,0),\"\"),IF(AM12=J12,\"[/b]\",\"\"),\"..... vs \",IF(AN12=J12,\"[b]\",\"\"),AN12,IF(AND(AN12<>\"\",AN12<>\"(Q)\"),VLOOKUP(AN12,$Q$11:$R$200,2,0),\"\"),IF(AN12=J12,\"[/b]\",\"\"),\"..... ( \",IF(AM12=J12,\"[b]\",\"\"),Коэффициенты!F12,IF(AM12=J12,\"[/b]\",\"\"),\" - \",IF(AN12=J12,\"[b]\",\"\"),Коэффициенты!G12,IF(AN12=J12,\"[/b]\",\"\"),\" )\",IF(J12=\"\",$M$13,\"\"))),\"\"),\"\")","v":{"$error":"#N/A"}},null,null,null,null,null,null,null,"[color=#00BF00]",null,null,{"$f":"IF(Коэффициенты!L12<>\"\",Коэффициенты!L12,\"\")","v":2},{"$f":"IF(Коэффициенты!M12<>\"\",Коэффициенты!M12,\"\")","v":"N. Djokovic"},"(1)",null,null,null,null,null,null,null,null,null,null,null,null,null,null,null,null,null,null,null,null,{"$f":"IF(Коэффициенты!D12<>\"\",Коэффициенты!D12,\"\")","v":0},{"$f":"IF(Коэффициенты!E12<>\"\",Коэффициенты!E12,\"\")","v":0},"…"]
[null,{"$f":"IF(Коэффициенты!B13<>\"\",Коэффициенты!B13,\"\")","v":""},"",{"$f":"IF(Коэффициенты!C13<>\"\",Коэффициенты!C13,\"\")","v":2},{"$f":"IF(AND(AM13<>\"\",AN13<>\"\"),IF(OR(AM13<>\"\",AN13<>\"\"),IF(AN13=\"bye\",CONCATENATE($M$16,AM13,IF(AND(AM13<>\"\",AM13<>\"(Q)\"),VLOOKUP(AM13,$Q$11:$R$200,2,0),\"\"),\"..... vs \",AN13,$M$17),CONCATENATE(IF(J13=\"\",$M$12,\"\"),IF(AM13=J13,\"[b]\",\"\"),AM13,IF(AND(AM13<>\"\",AM13<>\"(Q)\"),VLOOKUP(AM13,$Q$11:$R$200,2,0),\"\"),IF(AM13=J13,\"[/b]\",\"\"),\"..... vs \",IF(AN13=J13,\"[b]\",\"\"),AN13,IF(AND(AN13<>\"\",AN13<>\"(Q)\"),VLOOKUP(AN13,$Q$11:$R$200,2,0),\"\"),IF(AN13=J13,\"[/b]\",\"\"),\"..... ( \",IF(AM13=J13,\"[b]\",\"\"),Коэффициенты!F13,IF(AM13=J13,\"[/b]\",\"\"),\" - \",IF(AN13=J13,\"[b]\",\"\"),Коэффициенты!G13,IF(AN13=J13,\"[/b]\",\"\"),\" )\",IF(J13=\"\",$M$13,\"\"))),\"\"),\"\")","v":{"$error":"#N/A"}},null,null,null,null,null,null,null,"[/color]",null,null,{"$f":"IF(Коэффициенты!L13<>\"\",Коэффициенты!L13,\"\")","v":3},{"$f":"IF(Коэффициенты!M13<>\"\",Коэффициенты!M13,\"\")","v":"R. Nadal"},null,null,null,null,null,null,null,null,null,null,null,null,null,null,null,null,null,null,null,null,null,{"$f":"IF(Коэффициенты!D13<>\"\",Коэффициенты!D13,\"\")","v":0},{"$f":"IF(Коэффициенты!E13<>\"\",Коэффициенты!E13,\"\")","v":0},"…"]
[null,{"$f":"IF(Коэффициенты!B14<>\"\",Коэффициенты!B14,\"\")","v":"Четвертьфиналы"},"[size=11][color=#00BFFF][b]Четвертьфиналы[/b][/color][/size]",{"$f":"IF(Коэффициенты!C14<>\"\",Коэффициенты!C14,\"\")","v":1},{"$f":"IF(AND(AM14<>\"\",AN14<>\"\"),IF(OR(AM14<>\"\",AN14<>\"\"),IF(AN14=\"bye\",CONCATENATE($M$16,AM14,IF(AND(AM14<>\"\",AM14<>\"(Q)\"),VLOOKUP(AM14,$Q$11:$R$200,2,0),\"\"),\"..... vs \",AN14,$M$17),CONCATENATE(IF(J14=\"\",$M$12,\"\"),IF(AM14=J14,\"[b]\",\"\"),AM14,IF(AND(AM14<>\"\",AM14<>\"(Q)\"),VLOOKUP(AM14,$Q$11:$R$200,2,0),\"\"),IF(AM14=J14,\"[/b]\",\"\"),\"..... vs \",IF(AN14=J14,\"[b]\",\"\"),AN14,IF(AND(AN14<>\"\",AN14<>\"(Q)\"),VLOOKUP(AN14,$Q$11:$R$200,2,0),\"\"),IF(AN14=J14,\"[/b]\",\"\"),\"..... ( \",IF(AM14=J14,\"[b]\",\"\"),Коэффициенты!F14,IF(AM14=J14,\"[/b]\",\"\"),\" - \",IF(AN14=J14,\"[b]\",\"\"),Коэффициенты!G14,IF(AN14=J14,\"[/b]\",\"\"),\" )\",IF(J14=\"\",$M$13,\"\"))),\"\"),\"\")","v":{"$error":"#N/A"}},null,null,null,null,null,null,null,null,null,null,{"$f":"IF(Коэффициенты!L14<>\"\",Коэффициенты!L14,\"\")","v":4},{"$f":"IF(Коэффициенты!M14<>\"\",Коэффициенты!M14,\"\")","v":"A. Murray"},"(2)",null,null,null,null,null,null,null,null,null,null,null,null,null,null,null,null,null,null,null,null,{"$f":"IF(Коэффициенты!D14<>\"\",Коэффициенты!D14,\"\")","v":0},{"$f":"IF(Коэффициенты!E14<>\"\",Коэффициенты!E14,\"\")","v":0},"…"]
[null,{"$f":"IF(Коэффициенты!B15<>\"\",Коэффициенты!B15,\"\")","v":""},"",{"$f":"IF(Коэффициенты!C15<>\"\",Коэффициенты!C15,\"\")","v":2},{"$f":"IF(AND(AM15<>\"\",AN15<>\"\"),IF(OR(AM15<>\"\",AN15<>\"\"),IF(AN15=\"bye\",CONCATENATE($M$16,AM15,IF(AND(AM15<>\"\",AM15<>\"(Q)\"),VLOOKUP(AM15,$Q$11:$R$200,2,0),\"\"),\"..... vs \",AN15,$M$17),CONCATENATE(IF(J15=\"\",$M$12,\"\"),IF(AM15=J15,\"[b]\",\"\"),AM15,IF(AND(AM15<>\"\",AM15<>\"(Q)\"),VLOOKUP(AM15,$Q$11:$R$200,2,0),\"\"),IF(AM15=J15,\"[/b]\",\"\"),\"..... vs \",IF(AN15=J15,\"[b]\",\"\"),AN15,IF(AND(AN15<>\"\",AN15<>\"(Q)\"),VLOOKUP(AN15,$Q$11:$R$200,2,0),\"\"),IF(AN15=J15,\"[/b]\",\"\"),\"..... ( \",IF(AM15=J15,\"[b]\",\"\"),Коэффициенты!F15,IF(AM15=J15,\"[/b]\",\"\"),\" - \",IF(AN15=J15,\"[b]\",\"\"),Коэффициенты!G15,IF(AN15=J15,\"[/b]\",\"\"),\" )\",IF(J15=\"\",$M$13,\"\"))),\"\"),\"\")","v":{"$error":"#N/A"}},null,null,null,null,null,null,null,"для bye",null,null,{"$f":"IF(Коэффициенты!L15<>\"\",Коэффициенты!L15,\"\")","v":5},{"$f":"IF(Коэффициенты!M15<>\"\",Коэффициенты!M15,\"\")","v":"D. Ferrer"},null,null,null,null,null,null,null,null,null,null,null,null,null,null,null,null,null,null,null,null,null,{"$f":"IF(Коэффициенты!D15<>\"\",Коэффициенты!D15,\"\")","v":0},{"$f":"IF(Коэффициенты!E15<>\"\",Коэффициенты!E15,\"\")","v":0},"…"]
[null,{"$f":"IF(Коэффициенты!B16<>\"\",Коэффициенты!B16,\"\")","v":""},"",{"$f":"IF(Коэффициенты!C16<>\"\",Коэффициенты!C16,\"\")","v":3},{"$f":"IF(AND(AM16<>\"\",AN16<>\"\"),IF(OR(AM16<>\"\",AN16<>\"\"),IF(AN16=\"bye\",CONCATENATE($M$16,AM16,IF(AND(AM16<>\"\",AM16<>\"(Q)\"),VLOOKUP(AM16,$Q$11:$R$200,2,0),\"\"),\"..... vs \",AN16,$M$17),CONCATENATE(IF(J16=\"\",$M$12,\"\"),IF(AM16=J16,\"[b]\",\"\"),AM16,IF(AND(AM16<>\"\",AM16<>\"(Q)\"),VLOOKUP(AM16,$Q$11:$R$200,2,0),\"\"),IF(AM16=J16,\"[/b]\",\"\"),\"..... vs \",IF(AN16=J16,\"[b]\",\"\"),AN16,IF(AND(AN16<>\"\",AN16<>\"(Q)\"),VLOOKUP(AN16,$Q$11:$R$200,2,0),\"\"),IF(AN16=J16,\"[/b]\",\"\"),\"..... ( \",IF(AM16=J16,\"[b]\",\"\"),Коэффициенты!F16,IF(AM16=J16,\"[/b]\",\"\"),\" - \",IF(AN16=J16,\"[b]\",\"\"),Коэффициенты!G16,IF(AN16=J16,\"[/b]\",\"\"),\" )\",IF(J16=\"\",$M$13,\"\"))),\"\"),\"\")","v":{"$error":"#N/A"}},null,null,null,null,null,null,null,"[color=#BF4040]",null,null,{"$f":"IF(Коэффициенты!L16<>\"\",Коэффициенты!L16,\"\")","v":6},{"$f":"IF(Коэффициенты!M16<>\"\",Коэффициенты!M16,\"\")","v":"J.-W. Tsonga"},"(3)",null,null,null,null,null,null,null,null,null,null,null,null,null,null,null,null,null,null,null,null,{"$f":"IF(Коэффициенты!D16<>\"\",Коэффициенты!D16,\"\")","v":0},{"$f":"IF(Коэффициенты!E16<>\"\",Коэффициенты!E16,\"\")","v":0},"…"]
[null,{"$f":"IF(Коэффициенты!B17<>\"\",Коэффициенты!B17,\"\")","v":""},"",{"$f":"IF(Коэффициенты!C17<>\"\",Коэффициенты!C17,\"\")","v":4},{"$f":"IF(AND(AM17<>\"\",AN17<>\"\"),IF(OR(AM17<>\"\",AN17<>\"\"),IF(AN17=\"bye\",CONCATENATE($M$16,AM17,IF(AND(AM17<>\"\",AM17<>\"(Q)\"),VLOOKUP(AM17,$Q$11:$R$200,2,0),\"\"),\"..... vs \",AN17,$M$17),CONCATENATE(IF(J17=\"\",$M$12,\"\"),IF(AM17=J17,\"[b]\",\"\"),AM17,IF(AND(AM17<>\"\",AM17<>\"(Q)\"),VLOOKUP(AM17,$Q$11:$R$200,2,0),\"\"),IF(AM17=J17,\"[/b]\",\"\"),\"..... vs \",IF(AN17=J17,\"[b]\",\"\"),AN17,IF(AND(AN17<>\"\",AN17<>\"(Q)\"),VLOOKUP(AN17,$Q$11:$R$200,2,0),\"\"),IF(AN17=J17,\"[/b]\",\"\"),\"..... ( \",IF(AM17=J17,\"[b]\",\"\"),Коэффициенты!F17,IF(AM17=J17,\"[/b]\",\"\"),\" - \",IF(AN17=J17,\"[b]\",\"\"),Коэффициенты!G17,IF(AN17=J17,\"[/b]\",\"\"),\" )\",IF(J17=\"\",$M$13,\"\"))),\"\"),\"\")","v":{"$error":"#N/A"}},null,null,null,null,null,null,null,"[/color]",null,null,{"$f":"IF(Коэффициенты!L17<>\"\",Коэффициенты!L17,\"\")","v":7},{"$f":"IF(Коэффициенты!M17<>\"\",Коэффициенты!M17,\"\")","v":"T. Berdych"},"(4)",null,null,null,null,null,null,null,null,null,null,null,null,null,null,null,null,null,null,null,null,{"$f":"IF(Коэффициенты!D17<>\"\",Коэффициенты!D17,\"\")","v":0},{"$f":"IF(Коэффициенты!E17<>\"\",Коэффициенты!E17,\"\")","v":0},"…"]
[null,{"$f":"IF(Коэффициенты!B18<>\"\",Коэффициенты!B18,\"\")","v":"Третий круг"},"[size=11][color=#00BFFF][b]Третий круг[/b][/color][/size]",{"$f":"IF(Коэффициенты!C18<>\"\",Коэффициенты!C18,\"\")","v":1},{"$f":"IF(AND(AM18<>\"\",AN18<>\"\"),IF(OR(AM18<>\"\",AN18<>\"\"),IF(AN18=\"bye\",CONCATENATE($M$16,AM18,IF(AND(AM18<>\"\",AM18<>\"(Q)\"),VLOOKUP(AM18,$Q$11:$R$200,2,0),\"\"),\"..... vs \",AN18,$M$17),CONCATENATE(IF(J18=\"\",$M$12,\"\"),IF(AM18=J18,\"[b]\",\"\"),AM18,IF(AND(AM18<>\"\",AM18<>\"(Q)\"),VLOOKUP(AM18,$Q$11:$R$200,2,0),\"\"),IF(AM18=J18,\"[/b]\",\"\"),\"..... vs \",IF(AN18=J18,\"[b]\",\"\"),AN18,IF(AND(AN18<>\"\",AN18<>\"(Q)\"),VLOOKUP(AN18,$Q$11:$R$200,2,0),\"\"),IF(AN18=J18,\"[/b]\",\"\"),\"..... ( \",IF(AM18=J18,\"[b]\",\"\"),Коэффициенты!F18,IF(AM18=J18,\"[/b]\",\"\"),\" - \",IF(AN18=J18,\"[b]\",\"\"),Коэффициенты!G18,IF(AN18=J18,\"[/b]\",\"\"),\" )\",IF(J18=\"\",$M$13,\"\"))),\"\"),\"\")","v":{"$error":"#N/A"}},null,null,null,null,null,null,null,null,null,null,{"$f":"IF(Коэффициенты!L18<>\"\",Коэффициенты!L18,\"\")","v":8},{"$f":"IF(Коэффициенты!M18<>\"\",Коэффициенты!M18,\"\")","v":"J. Tipsarevic"},"(5)",null,null,null,null,null,null,null,null,null,null,null,null,null,null,null,null,null,null,null,null,{"$f":"IF(Коэффициенты!D18<>\"\",Коэффициенты!D18,\"\")","v":0},{"$f":"IF(Коэффициенты!E18<>\"\",Коэффициенты!E18,\"\")","v":0},{"$f":"IF(AND(AM18<>\"\",AN18<>\"\"),\"…\",\"\")","v":"…"}]
[null,{"$f":"IF(Коэффициенты!B19<>\"\",Коэффициенты!B19,\"\")","v":""},"",{"$f":"IF(Коэффициенты!C19<>\"\",Коэффициенты!C19,\"\")","v":2},{"$f":"IF(AND(AM19<>\"\",AN19<>\"\"),IF(OR(AM19<>\"\",AN19<>\"\"),IF(AN19=\"bye\",CONCATENATE($M$16,AM19,IF(AND(AM19<>\"\",AM19<>\"(Q)\"),VLOOKUP(AM19,$Q$11:$R$200,2,0),\"\"),\"..... vs \",AN19,$M$17),CONCATENATE(IF(J19=\"\",$M$12,\"\"),IF(AM19=J19,\"[b]\",\"\"),AM19,IF(AND(AM19<>\"\",AM19<>\"(Q)\"),VLOOKUP(AM19,$Q$11:$R$200,2,0),\"\"),IF(AM19=J19,\"[/b]\",\"\"),\"..... vs \",IF(AN19=J19,\"[b]\",\"\"),AN19,IF(AND(AN19<>\"\",AN19<>\"(Q)\"),VLOOKUP(AN19,$Q$11:$R$200,2,0),\"\"),IF(AN19=J19,\"[/b]\",\"\"),\"..... ( \",IF(AM19=J19,\"[b]\",\"\"),Коэффициенты!F19,IF(AM19=J19,\"[/b]\",\"\"),\" - \",IF(AN19=J19,\"[b]\",\"\"),Коэффициенты!G19,IF(AN19=J19,\"[/b]\",\"\"),\" )\",IF(J19=\"\",$M$13,\"\"))),\"\"),\"\")","v":{"$error":"#N/A"}},null,null,null,null,null,null,null,"для названий кругов",null,null,{"$f":"IF(Коэффициенты!L19<>\"\",Коэффициенты!L19,\"\")","v":9},{"$f":"IF(Коэффициенты!M19<>\"\",Коэффициенты!M19,\"\")","v":"J.M. Del Potro"},"(6)",null,null,null,null,null,null,null,null,null,null,null,null,null,null,null,null,null,null,null,null,{"$f":"IF(Коэффициенты!D19<>\"\",Коэффициенты!D19,\"\")","v":0},{"$f":"IF(Коэффициенты!E19<>\"\",Коэффициенты!E19,\"\")","v":0},{"$f":"IF(AND(AM19<>\"\",AN19<>\"\"),\"…\",\"\")","v":"…"}]
[null,{"$f":"IF(Коэффициенты!B20<>\"\",Коэффициенты!B20,\"\")","v":""},"",{"$f":"IF(Коэффициенты!C20<>\"\",Коэффициенты!C20,\"\")","v":3},{"$f":"IF(AND(AM20<>\"\",AN20<>\"\"),IF(OR(AM20<>\"\",AN20<>\"\"),IF(AN20=\"bye\",CONCATENATE($M$16,AM20,IF(AND(AM20<>\"\",AM20<>\"(Q)\"),VLOOKUP(AM20,$Q$11:$R$200,2,0),\"\"),\"..... vs \",AN20,$M$17),CONCATENATE(IF(J20=\"\",$M$12,\"\"),IF(AM20=J20,\"[b]\",\"\"),AM20,IF(AND(AM20<>\"\",AM20<>\"(Q)\"),VLOOKUP(AM20,$Q$11:$R$200,2,0),\"\"),IF(AM20=J20,\"[/b]\",\"\"),\"..... vs \",IF(AN20=J20,\"[b]\",\"\"),AN20,IF(AND(AN20<>\"\",AN20<>\"(Q)\"),VLOOKUP(AN20,$Q$11:$R$200,2,0),\"\"),IF(AN20=J20,\"[/b]\",\"\"),\"..... ( \",IF(AM20=J20,\"[b]\",\"\"),Коэффициенты!F20,IF(AM20=J20,\"[/b]\",\"\"),\" - \",IF(AN20=J20,\"[b]\",\"\"),Коэффициенты!G20,IF(AN20=J20,\"[/b]\",\"\"),\" )\",IF(J20=\"\",$M$13,\"\"))),\"\"),\"\")","v":{"$error":"#N/A"}},null,null,null,null,null,null,null,"[size=11][color=#00BFFF][b]",null,null,{"$f":"IF(Коэффициенты!L20<>\"\",Коэффициенты!L20,\"\")","v":10},{"$f":"IF(Коэффициенты!M20<>\"\",Коэффициенты!M20,\"\")","v":"J. Monaco"},"(7)",null,null,null,null,null,null,null,null,null,null,null,null,null,null,null,null,null,null,null,null,{"$f":"IF(Коэффициенты!D20<>\"\",Коэффициенты!D20,\"\")","v":0},{"$f":"IF(Коэффициенты!E20<>\"\",Коэффициенты!E20,\"\")","v":0},"…"]
[null,{"$f":"IF(Коэффициенты!B21<>\"\",Коэффициенты!B21,\"\")","v":""},"",{"$f":"IF(Коэффициенты!C21<>\"\",Коэффициенты!C21,\"\")","v":4},{"$f":"IF(AND(AM21<>\"\",AN21<>\"\"),IF(OR(AM21<>\"\",AN21<>\"\"),IF(AN21=\"bye\",CONCATENATE($M$16,AM21,IF(AND(AM21<>\"\",AM21<>\"(Q)\"),VLOOKUP(AM21,$Q$11:$R$200,2,0),\"\"),\"..... vs \",AN21,$M$17),CONCATENATE(IF(J21=\"\",$M$12,\"\"),IF(AM21=J21,\"[b]\",\"\"),AM21,IF(AND(AM21<>\"\",AM21<>\"(Q)\"),VLOOKUP(AM21,$Q$11:$R$200,2,0),\"\"),IF(AM21=J21,\"[/b]\",\"\"),\"..... vs \",IF(AN21=J21,\"[b]\",\"\"),AN21,IF(AND(AN21<>\"\",AN21<>\"(Q)\"),VLOOKUP(AN21,$Q$11:$R$200,2,0),\"\"),IF(AN21=J21,\"[/b]\",\"\"),\"..... ( \",IF(AM21=J21,\"[b]\",\"\"),Коэффициенты!F21,IF(AM21=J21,\"[/b]\",\"\"),\" - \",IF(AN21=J21,\"[b]\",\"\"),Коэффициенты!G21,IF(AN21=J21,\"[/b]\",\"\"),\" )\",IF(J21=\"\",$M$13,\"\"))),\"\"),\"\")","v":{"$error":"#N/A"}},null,null,null,null,null,null,null,"[/b][/color][/size]",null,null,{"$f":"IF(Коэффициенты!L21<>\"\",Коэффициенты!L21,\"\")","v":11},{"$f":"IF(Коэффициенты!M21<>\"\",Коэффициенты!M21,\"\")","v":"J. Isner"},"(8)",null,null,null,null,null,null,null,null,null,null,null,null,null,null,null,null,null,null,null,null,{"$f":"IF(Коэффициенты!D21<>\"\",Коэффициенты!D21,\"\")","v":0},{"$f":"IF(Коэффициенты!E21<>\"\",Коэффициенты!E21,\"\")","v":0},"…"]
[null,{"$f":"IF(Коэффициенты!B22<>\"\",Коэффициенты!B22,\"\")","v":""},"",{"$f":"IF(Коэффициенты!C22<>\"\",Коэффициенты!C22,\"\")","v":5},{"$f":"IF(AND(AM22<>\"\",AN22<>\"\"),IF(OR(AM22<>\"\",AN22<>\"\"),IF(AN22=\"bye\",CONCATENATE($M$16,AM22,IF(AND(AM22<>\"\",AM22<>\"(Q)\"),VLOOKUP(AM22,$Q$11:$R$200,2,0),\"\"),\"..... vs \",AN22,$M$17),CONCATENATE(IF(J22=\"\",$M$12,\"\"),IF(AM22=J22,\"[b]\",\"\"),AM22,IF(AND(AM22<>\"\",AM22<>\"(Q)\"),VLOOKUP(AM22,$Q$11:$R$200,2,0),\"\"),IF(AM22=J22,\"[/b]\",\"\"),\"..... vs \",IF(AN22=J22,\"[b]\",\"\"),AN22,IF(AND(AN22<>\"\",AN22<>\"(Q)\"),VLOOKUP(AN22,$Q$11:$R$200,2,0),\"\"),IF(AN22=J22,\"[/b]\",\"\"),\"..... ( \",IF(AM22=J22,\"[b]\",\"\"),Коэффициенты!F22,IF(AM22=J22,\"[/b]\",\"\"),\" - \",IF(AN22=J22,\"[b]\",\"\"),Коэффициенты!G22,IF(AN22=J22,\"[/b]\",\"\"),\" )\",IF(J22=\"\",$M$13,\"\"))),\"\"),\"\")","v":{"$error":"#N/A"}},null,null,null,null,null,null,null,null,null,null,{"$f":"IF(Коэффициенты!L22<>\"\",Коэффициенты!L22,\"\")","v":12},{"$f":"IF(Коэффициенты!M22<>\"\",Коэффициенты!M22,\"\")","v":"N. Almagro"},null,null,null,null,null,null,null,null,null,null,null,null,null,null,null,null,null,null,null,null,null,{"$f":"IF(Коэффициенты!D22<>\"\",Коэффициенты!D22,\"\")","v":0},{"$f":"IF(Коэффициенты!E22<>\"\",Коэффициенты!E22,\"\")","v":0},"…"]
[null,{"$f":"IF(Коэффициенты!B23<>\"\",Коэффициенты!B23,\"\")","v":""},"",{"$f":"IF(Коэффициенты!C23<>\"\",Коэффициенты!C23,\"\")","v":6},{"$f":"IF(AND(AM23<>\"\",AN23<>\"\"),IF(OR(AM23<>\"\",AN23<>\"\"),IF(AN23=\"bye\",CONCATENATE($M$16,AM23,IF(AND(AM23<>\"\",AM23<>\"(Q)\"),VLOOKUP(AM23,$Q$11:$R$200,2,0),\"\"),\"..... vs \",AN23,$M$17),CONCATENATE(IF(J23=\"\",$M$12,\"\"),IF(AM23=J23,\"[b]\",\"\"),AM23,IF(AND(AM23<>\"\",AM23<>\"(Q)\"),VLOOKUP(AM23,$Q$11:$R$200,2,0),\"\"),IF(AM23=J23,\"[/b]\",\"\"),\"..... vs \",IF(AN23=J23,\"[b]\",\"\"),AN23,IF(AND(AN23<>\"\",AN23<>\"(Q)\"),VLOOKUP(AN23,$Q$11:$R$200,2,0),\"\"),IF(AN23=J23,\"[/b]\",\"\"),\"..... ( \",IF(AM23=J23,\"[b]\",\"\"),Коэффициенты!F23,IF(AM23=J23,\"[/b]\",\"\"),\" - \",IF(AN23=J23,\"[b]\",\"\"),Коэффициенты!G23,IF(AN23=J23,\"[/b]\",\"\"),\" )\",IF(J23=\"\",$M$13,\"\"))),\"\"),\"\")","v":{"$error":"#N/A"}},null,null,null,null,null,null,null,null,null,null,{"$f":"IF(Коэффициенты!L23<>\"\",Коэффициенты!L23,\"\")","v":13},{"$f":"IF(Коэффициенты!M23<>\"\",Коэффициенты!M23,\"\")","v":"G. Simon"},"(9)",null,null,null,null,null,null,null,null,null,null,null,null,null,null,null,null,null,null,null,null,{"$f":"IF(Коэффициенты!D23<>\"\",Коэффициенты!D23,\"\")","v":0},{"$f":"IF(Коэффициенты!E23<>\"\",Коэффициенты!E23,\"\")","v":0},"…"]
[null,{"$f":"IF(Коэффициенты!B24<>\"\",Коэффициенты!B24,\"\")","v":""},"",{"$f":"IF(Коэффициенты!C24<>\"\",Коэффициенты!C24,\"\")","v":7},{"$f":"IF(AND(AM24<>\"\",AN24<>\"\"),IF(OR(AM24<>\"\",AN24<>\"\"),IF(AN24=\"bye\",CONCATENATE($M$16,AM24,IF(AND(AM24<>\"\",AM24<>\"(Q)\"),VLOOKUP(AM24,$Q$11:$R$200,2,0),\"\"),\"..... vs \",AN24,$M$17),CONCATENATE(IF(J24=\"\",$M$12,\"\"),IF(AM24=J24,\"[b]\",\"\"),AM24,IF(AND(AM24<>\"\",AM24<>\"(Q)\"),VLOOKUP(AM24,$Q$11:$R$200,2,0),\"\"),IF(AM24=J24,\"[/b]\",\"\"),\"..... vs \",IF(AN24=J24,\"[b]\",\"\"),AN24,IF(AND(AN24<>\"\",AN24<>\"(Q)\"),VLOOKUP(AN24,$Q$11:$R$200,2,0),\"\"),IF(AN24=J24,\"[/b]\",\"\"),\"..... ( \",IF(AM24=J24,\"[b]\",\"\"),Коэффициенты!F24,IF(AM24=J24,\"[/b]\",\"\"),\" - \",IF(AN24=J24,\"[b]\",\"\"),Коэффициенты!G24,IF(AN24=J24,\"[/b]\",\"\"),\" )\",IF(J24=\"\",$M$13,\"\"))),\"\"),\"\")","v":{"$error":"#N/A"}},null,null,null,null,null,null,null,null,null,null,{"$f":"IF(Коэффициенты!L24<>\"\",Коэффициенты!L24,\"\")","v":14},{"$f":"IF(Коэффициенты!M24<>\"\",Коэффициенты!M24,\"\")","v":"M. Cilic"},"(10)",null,null,null,null,null,null,null,null,null,null,null,null,null,null,null,null,null,null,null,null,{"$f":"IF(Коэффициенты!D24<>\"\",Коэффициенты!D24,\"\")","v":0},{"$f":"IF(Коэффициенты!E24<>\"\",Коэффициенты!E24,\"\")","v":0},"…"]
[null,{"$f":"IF(Коэффициенты!B25<>\"\",Коэффициенты!B25,\"\")","v":""},"",{"$f":"IF(Коэффициенты!C25<>\"\",Коэффициенты!C25,\"\")","v":8},{"$f":"IF(AND(AM25<>\"\",AN25<>\"\"),IF(OR(AM25<>\"\",AN25<>\"\"),IF(AN25=\"bye\",CONCATENATE($M$16,AM25,IF(AND(AM25<>\"\",AM25<>\"(Q)\"),VLOOKUP(AM25,$Q$11:$R$200,2,0),\"\"),\"..... vs \",AN25,$M$17),CONCATENATE(IF(J25=\"\",$M$12,\"\"),IF(AM25=J25,\"[b]\",\"\"),AM25,IF(AND(AM25<>\"\",AM25<>\"(Q)\"),VLOOKUP(AM25,$Q$11:$R$200,2,0),\"\"),IF(AM25=J25,\"[/b]\",\"\"),\"..... vs \",IF(AN25=J25,\"[b]\",\"\"),AN25,IF(AND(AN25<>\"\",AN25<>\"(Q)\"),VLOOKUP(AN25,$Q$11:$R$200,2,0),\"\"),IF(AN25=J25,\"[/b]\",\"\"),\"..... ( \",IF(AM25=J25,\"[b]\",\"\"),Коэффициенты!F25,IF(AM25=J25,\"[/b]\",\"\"),\" - \",IF(AN25=J25,\"[b]\",\"\"),Коэффициенты!G25,IF(AN25=J25,\"[/b]\",\"\"),\" )\",IF(J25=\"\",$M$13,\"\"))),\"\"),\"\")","v":{"$error":"#N/A"}},null,null,null,null,null,null,null,null,null,null,{"$f":"IF(Коэффициенты!L25<>\"\",Коэффициенты!L25,\"\")","v":15},{"$f":"IF(Коэффициенты!M25<>\"\",Коэффициенты!M25,\"\")","v":"M. Fish"},"(11)",null,null,null,null,null,null,null,null,null,null,null,null,null,null,null,null,null,null,null,null,{"$f":"IF(Коэффициенты!D25<>\"\",Коэффициенты!D25,\"\")","v":0},{"$f":"IF(Коэффициенты!E25<>\"\",Коэффициенты!E25,\"\")","v":0},"…"]
[null,{"$f":"IF(Коэффициенты!B26<>\"\",Коэффициенты!B26,\"\")","v":"Второй круг"},"[size=11][color=#00BFFF][b]Второй круг[/b][/color][/size]",{"$f":"IF(Коэффициенты!C26<>\"\",Коэффициенты!C26,\"\")","v":1},{"$f":"IF(AND(AM26<>\"\",AN26<>\"\"),IF(OR(AM26<>\"\",AN26<>\"\"),IF(AN26=\"bye\",CONCATENATE($M$16,AM26,IF(AND(AM26<>\"\",AM26<>\"(Q)\"),VLOOKUP(AM26,$Q$11:$R$200,2,0),\"\"),\"..... vs \",AN26,$M$17),CONCATENATE(IF(J26=\"\",$M$12,\"\"),IF(AM26=J26,\"[b]\",\"\"),AM26,IF(AND(AM26<>\"\",AM26<>\"(Q)\"),VLOOKUP(AM26,$Q$11:$R$200,2,0),\"\"),IF(AM26=J26,\"[/b]\",\"\"),\"..... vs \",IF(AN26=J26,\"[b]\",\"\"),AN26,IF(AND(AN26<>\"\",AN26<>\"(Q)\"),VLOOKUP(AN26,$Q$11:$R$200,2,0),\"\"),IF(AN26=J26,\"[/b]\",\"\"),\"..... ( \",IF(AM26=J26,\"[b]\",\"\"),Коэффициенты!F26,IF(AM26=J26,\"[/b]\",\"\"),\" - \",IF(AN26=J26,\"[b]\",\"\"),Коэффициенты!G26,IF(AN26=J26,\"[/b]\",\"\"),\" )\",IF(J26=\"\",$M$13,\"\"))),\"\"),\"\")","v":{"$error":"#N/A"}},null,null,null,null,null,null,null,null,null,null,{"$f":"IF(Коэффициенты!L26<>\"\",Коэффициенты!L26,\"\")","v":16},{"$f":"IF(Коэффициенты!M26<>\"\",Коэффициенты!M26,\"\")","v":"P. Kohlschreiber"},"(12)",null,null,null,null,null,null,null,null,null,null,null,null,null,null,null,null,null,null,null,null,{"$f":"IF(Коэффициенты!D26<>\"\",Коэффициенты!D26,\"\")","v":0},{"$f":"IF(Коэффициенты!E26<>\"\",Коэффициенты!E26,\"\")","v":0},"…"]
[null,{"$f":"IF(Коэффициенты!B27<>\"\",Коэффициенты!B27,\"\")","v":""},"",{"$f":"IF(Коэффициенты!C27<>\"\",Коэффициенты!C27,\"\")","v":2},{"$f":"IF(AND(AM27<>\"\",AN27<>\"\"),IF(OR(AM27<>\"\",AN27<>\"\"),IF(AN27=\"bye\",CONCATENATE($M$16,AM27,IF(AND(AM27<>\"\",AM27<>\"(Q)\"),VLOOKUP(AM27,$Q$11:$R$200,2,0),\"\"),\"..... vs \",AN27,$M$17),CONCATENATE(IF(J27=\"\",$M$12,\"\"),IF(AM27=J27,\"[b]\",\"\"),AM27,IF(AND(AM27<>\"\",AM27<>\"(Q)\"),VLOOKUP(AM27,$Q$11:$R$200,2,0),\"\"),IF(AM27=J27,\"[/b]\",\"\"),\"..... vs \",IF(AN27=J27,\"[b]\",\"\"),AN27,IF(AND(AN27<>\"\",AN27<>\"(Q)\"),VLOOKUP(AN27,$Q$11:$R$200,2,0),\"\"),IF(AN27=J27,\"[/b]\",\"\"),\"..... ( \",IF(AM27=J27,\"[b]\",\"\"),Коэффициенты!F27,IF(AM27=J27,\"[/b]\",\"\"),\" - \",IF(AN27=J27,\"[b]\",\"\"),Коэффициенты!G27,IF(AN27=J27,\"[/b]\",\"\"),\" )\",IF(J27=\"\",$M$13,\"\"))),\"\"),\"\")","v":{"$error":"#N/A"}},null,null,null,null,null,null,null,null,null,null,{"$f":"IF(Коэффициенты!L27<>\"\",Коэффициенты!L27,\"\")","v":17},{"$f":"IF(Коэффициенты!M27<>\"\",Коэффициенты!M27,\"\")","v":"K. Nishikori"},"(13)",null,null,null,null,null,null,null,null,null,null,null,null,null,null,null,null,null,null,null,null,{"$f":"IF(Коэффициенты!D27<>\"\",Коэффициенты!D27,\"\")","v":0},{"$f":"IF(Коэффициенты!E27<>\"\",Коэффициенты!E27,\"\")","v":0},"…"]
[null,{"$f":"IF(Коэффициенты!B28<>\"\",Коэффициенты!B28,\"\")","v":""},"",{"$f":"IF(Коэффициенты!C28<>\"\",Коэффициенты!C28,\"\")","v":3},{"$f":"IF(AND(AM28<>\"\",AN28<>\"\"),IF(OR(AM28<>\"\",AN28<>\"\"),IF(AN28=\"bye\",CONCATENATE($M$16,AM28,IF(AND(AM28<>\"\",AM28<>\"(Q)\"),VLOOKUP(AM28,$Q$11:$R$200,2,0),\"\"),\"..... vs \",AN28,$M$17),CONCATENATE(IF(J28=\"\",$M$12,\"\"),IF(AM28=J28,\"[b]\",\"\"),AM28,IF(AND(AM28<>\"\",AM28<>\"(Q)\"),VLOOKUP(AM28,$Q$11:$R$200,2,0),\"\"),IF(AM28=J28,\"[/b]\",\"\"),\"..... vs \",IF(AN28=J28,\"[b]\",\"\"),AN28,IF(AND(AN28<>\"\",AN28<>\"(Q)\"),VLOOKUP(AN28,$Q$11:$R$200,2,0),\"\"),IF(AN28=J28,\"[/b]\",\"\"),\"..... ( \",IF(AM28=J28,\"[b]\",\"\"),Коэффициенты!F28,IF(AM28=J28,\"[/b]\",\"\"),\" - \",IF(AN28=J28,\"[b]\",\"\"),Коэффициенты!G28,IF(AN28=J28,\"[/b]\",\"\"),\" )\",IF(J28=\"\",$M$13,\"\"))),\"\"),\"\")","v":{"$error":"#N/A"}},null,null,null,null,null,null,null,null,null,null,{"$f":"IF(Коэффициенты!L28<>\"\",Коэффициенты!L28,\"\")","v":18},{"$f":"IF(Коэффициенты!M28<>\"\",Коэффициенты!M28,\"\")","v":"G. Monfils"},null,null,null,null,null,null,null,null,null,null,null,null,null,null,null,null,null,null,null,null,null,{"$f":"IF(Коэффициенты!D28<>\"\",Коэффициенты!D28,\"\")","v":0},{"$f":"IF(Коэффициенты!E28<>\"\",Коэффициенты!E28,\"\")","v":0},"…"]
[null,{"$f":"IF(Коэффициенты!B29<>\"\",Коэффициенты!B29,\"\")","v":""},"",{"$f":"IF(Коэффициенты!C29<>\"\",Коэффициенты!C29,\"\")","v":4},{"$f":"IF(AND(AM29<>\"\",AN29<>\"\"),IF(OR(AM29<>\"\",AN29<>\"\"),IF(AN29=\"bye\",CONCATENATE($M$16,AM29,IF(AND(AM29<>\"\",AM29<>\"(Q)\"),VLOOKUP(AM29,$Q$11:$R$200,2,0),\"\"),\"..... vs \",AN29,$M$17),CONCATENATE(IF(J29=\"\",$M$12,\"\"),IF(AM29=J29,\"[b]\",\"\"),AM29,IF(AND(AM29<>\"\",AM29<>\"(Q)\"),VLOOKUP(AM29,$Q$11:$R$200,2,0),\"\"),IF(AM29=J29,\"[/b]\",\"\"),\"..... vs \",IF(AN29=J29,\"[b]\",\"\"),AN29,IF(AND(AN29<>\"\",AN29<>\"(Q)\"),VLOOKUP(AN29,$Q$11:$R$200,2,0),\"\"),IF(AN29=J29,\"[/b]\",\"\"),\"..... ( \",IF(AM29=J29,\"[b]\",\"\"),Коэффициенты!F29,IF(AM29=J29,\"[/b]\",\"\"),\" - \",IF(AN29=J29,\"[b]\",\"\"),Коэффициенты!G29,IF(AN29=J29,\"[/b]\",\"\"),\" )\",IF(J29=\"\",$M$13,\"\"))),\"\"),\"\")","v":{"$error":"#N/A"}},null,null,null,null,null,null,null,null,null,null,{"$f":"IF(Коэффициенты!L29<>\"\",Коэффициенты!L29,\"\")","v":19},{"$f":"IF(Коэффициенты!M29<>\"\",Коэффициенты!M29,\"\")","v":"R. Gasquet"},"(14)",null,null,null,null,null,null,null,null,null,null,null,null,null,null,null,null,null,null,null,null,{"$f":"IF(Коэффициенты!D29<>\"\",Коэффициенты!D29,\"\")","v":0},{"$f":"IF(Коэффициенты!E29<>\"\",Коэффициенты!E29,\"\")","v":0},"…"]
[null,{"$f":"IF(Коэффициенты!B30<>\"\",Коэффициенты!B30,\"\")","v":""},"",{"$f":"IF(Коэффициенты!C30<>\"\",Коэффициенты!C30,\"\")","v":5},{"$f":"IF(AND(AM30<>\"\",AN30<>\"\"),IF(OR(AM30<>\"\",AN30<>\"\"),IF(AN30=\"bye\",CONCATENATE($M$16,AM30,IF(AND(AM30<>\"\",AM30<>\"(Q)\"),VLOOKUP(AM30,$Q$11:$R$200,2,0),\"\"),\"..... vs \",AN30,$M$17),CONCATENATE(IF(J30=\"\",$M$12,\"\"),IF(AM30=J30,\"[b]\",\"\"),AM30,IF(AND(AM30<>\"\",AM30<>\"(Q)\"),VLOOKUP(AM30,$Q$11:$R$200,2,0),\"\"),IF(AM30=J30,\"[/b]\",\"\"),\"..... vs \",IF(AN30=J30,\"[b]\",\"\"),AN30,IF(AND(AN30<>\"\",AN30<>\"(Q)\"),VLOOKUP(AN30,$Q$11:$R$200,2,0),\"\"),IF(AN30=J30,\"[/b]\",\"\"),\"..... ( \",IF(AM30=J30,\"[b]\",\"\"),Коэффициенты!F30,IF(AM30=J30,\"[/b]\",\"\"),\" - \",IF(AN30=J30,\"[b]\",\"\"),Коэффициенты!G30,IF(AN30=J30,\"[/b]\",\"\"),\" )\",IF(J30=\"\",$M$13,\"\"))),\"\"),\"\")","v":{"$error":"#N/A"}},null,null,null,null,null,null,null,null,null,null,{"$f":"IF(Коэффициенты!L30<>\"\",Коэффициенты!L30,\"\")","v":20},{"$f":"IF(Коэффициенты!M30<>\"\",Коэффициенты!M30,\"\")","v":"A. Roddick"},null,null,null,null,null,null,null,null,null,null,null,null,null,null,null,null,null,null,null,null,null,{"$f":"IF(Коэффициенты!D30<>\"\",Коэффициенты!D30,\"\")","v":0},{"$f":"IF(Коэффициенты!E30<>\"\",Коэффициенты!E30,\"\")","v":0},"…"]
[null,{"$f":"IF(Коэффициенты!B31<>\"\",Коэффициенты!B31,\"\")","v":""},"",{"$f":"IF(Коэффициенты!C31<>\"\",Коэффициенты!C31,\"\")","v":6},{"$f":"IF(AND(AM31<>\"\",AN31<>\"\"),IF(OR(AM31<>\"\",AN31<>\"\"),IF(AN31=\"bye\",CONCATENATE($M$16,AM31,IF(AND(AM31<>\"\",AM31<>\"(Q)\"),VLOOKUP(AM31,$Q$11:$R$200,2,0),\"\"),\"..... vs \",AN31,$M$17),CONCATENATE(IF(J31=\"\",$M$12,\"\"),IF(AM31=J31,\"[b]\",\"\"),AM31,IF(AND(AM31<>\"\",AM31<>\"(Q)\"),VLOOKUP(AM31,$Q$11:$R$200,2,0),\"\"),IF(AM31=J31,\"[/b]\",\"\"),\"..... vs \",IF(AN31=J31,\"[b]\",\"\"),AN31,IF(AND(AN31<>\"\",AN31<>\"(Q)\"),VLOOKUP(AN31,$Q$11:$R$200,2,0),\"\"),IF(AN31=J31,\"[/b]\",\"\"),\"..... ( \",IF(AM31=J31,\"[b]\",\"\"),Коэффициенты!F31,IF(AM31=J31,\"[/b]\",\"\"),\" - \",IF(AN31=J31,\"[b]\",\"\"),Коэффициенты!G31,IF(AN31=J31,\"[/b]\",\"\"),\" )\",IF(J31=\"\",$M$13,\"\"))),\"\"),\"\")","v":{"$error":"#N/A"}},null,null,null,null,null,null,null,null,null,null,{"$f":"IF(Коэффициенты!L31<>\"\",Коэффициенты!L31,\"\")","v":21},{"$f":"IF(Коэффициенты!M31<>\"\",Коэффициенты!M31,\"\")","v":"F. Mayer"},"(15)",null,null,null,null,null,null,null,null,null,null,null,null,null,null,null,null,null,null,null,null,{"$f":"IF(Коэффициенты!D31<>\"\",Коэффициенты!D31,\"\")","v":0},{"$f":"IF(Коэффициенты!E31<>\"\",Коэффициенты!E31,\"\")","v":0},"…"]
[null,{"$f":"IF(Коэффициенты!B32<>\"\",Коэффициенты!B32,\"\")","v":""},"",{"$f":"IF(Коэффициенты!C32<>\"\",Коэффициенты!C32,\"\")","v":7},{"$f":"IF(AND(AM32<>\"\",AN32<>\"\"),IF(OR(AM32<>\"\",AN32<>\"\"),IF(AN32=\"bye\",CONCATENATE($M$16,AM32,IF(AND(AM32<>\"\",AM32<>\"(Q)\"),VLOOKUP(AM32,$Q$11:$R$200,2,0),\"\"),\"..... vs \",AN32,$M$17),CONCATENATE(IF(J32=\"\",$M$12,\"\"),IF(AM32=J32,\"[b]\",\"\"),AM32,IF(AND(AM32<>\"\",AM32<>\"(Q)\"),VLOOKUP(AM32,$Q$11:$R$200,2,0),\"\"),IF(AM32=J32,\"[/b]\",\"\"),\"..... vs \",IF(AN32=J32,\"[b]\",\"\"),AN32,IF(AND(AN32<>\"\",AN32<>\"(Q)\"),VLOOKUP(AN32,$Q$11:$R$200,2,0),\"\"),IF(AN32=J32,\"[/b]\",\"\"),\"..... ( \",IF(AM32=J32,\"[b]\",\"\"),Коэффициенты!F32,IF(AM32=J32,\"[/b]\",\"\"),\" - \",IF(AN32=J32,\"[b]\",\"\"),Коэффициенты!G32,IF(AN32=J32,\"[/b]\",\"\"),\" )\",IF(J32=\"\",$M$13,\"\"))),\"\"),\"\")","v":{"$error":"#N/A"}},null,null,null,null,null,null,null,null,null,null,{"$f":"IF(Коэффициенты!L32<>\"\",Коэффициенты!L32,\"\")","v":22},{"$f":"IF(Коэффициенты!M32<>\"\",Коэффициенты!M32,\"\")","v":"M. Raonic"},"(16)",null,null,null,null,null,null,null,null,null,null,null,null,null,null,null,null,null,null,null,null,{"$f":"IF(Коэффициенты!D32<>\"\",Коэффициенты!D32,\"\")","v":0},{"$f":"IF(Коэффициенты!E32<>\"\",Коэффициенты!E32,\"\")","v":0},"…"]
[null,{"$f":"IF(Коэффициенты!B33<>\"\",Коэффициенты!B33,\"\")","v":""},"",{"$f":"IF(Коэффициенты!C33<>\"\",Коэффициенты!C33,\"\")","v":8},{"$f":"IF(AND(AM33<>\"\",AN33<>\"\"),IF(OR(AM33<>\"\",AN33<>\"\"),IF(AN33=\"bye\",CONCATENATE($M$16,AM33,IF(AND(AM33<>\"\",AM33<>\"(Q)\"),VLOOKUP(AM33,$Q$11:$R$200,2,0),\"\"),\"..... vs \",AN33,$M$17),CONCATENATE(IF(J33=\"\",$M$12,\"\"),IF(AM33=J33,\"[b]\",\"\"),AM33,IF(AND(AM33<>\"\",AM33<>\"(Q)\"),VLOOKUP(AM33,$Q$11:$R$200,2,0),\"\"),IF(AM33=J33,\"[/b]\",\"\"),\"..... vs \",IF(AN33=J33,\"[b]\",\"\"),AN33,IF(AND(AN33<>\"\",AN33<>\"(Q)\"),VLOOKUP(AN33,$Q$11:$R$200,2,0),\"\"),IF(AN33=J33,\"[/b]\",\"\"),\"..... ( \",IF(AM33=J33,\"[b]\",\"\"),Коэффициенты!F33,IF(AM33=J33,\"[/b]\",\"\"),\" - \",IF(AN33=J33,\"[b]\",\"\"),Коэффициенты!G33,IF(AN33=J33,\"[/b]\",\"\"),\" )\",IF(J33=\"\",$M$13,\"\"))),\"\"),\"\")","v":{"$error":"#N/A"}},null,null,null,null,null,null,null,null,null,null,{"$f":"IF(Коэффициенты!L33<>\"\",Коэффициенты!L33,\"\")","v":23},{"$f":"IF(Коэффициенты!M33<>\"\",Коэффициенты!M33,\"\")","v":"S. Wawrinka"},null,null,null,null,null,null,null,null,null,null,null,null,null,null,null,null,null,null,null,null,null,{"$f":"IF(Коэффициенты!D33<>\"\",Коэффициенты!D33,\"\")","v":0},{"$f":"IF(Коэффициенты!E33<>\"\",Коэффициенты!E33,\"\")","v":0},"…"]
[null,{"$f":"IF(Коэффициенты!B34<>\"\",Коэффициенты!B34,\"\")","v":""},"",{"$f":"IF(Коэффициенты!C34<>\"\",Коэффициенты!C34,\"\")","v":9},{"$f":"IF(AND(AM34<>\"\",AN34<>\"\"),IF(OR(AM34<>\"\",AN34<>\"\"),IF(AN34=\"bye\",CONCATENATE($M$16,AM34,IF(AND(AM34<>\"\",AM34<>\"(Q)\"),VLOOKUP(AM34,$Q$11:$R$200,2,0),\"\"),\"..... vs \",AN34,$M$17),CONCATENATE(IF(J34=\"\",$M$12,\"\"),IF(AM34=J34,\"[b]\",\"\"),AM34,IF(AND(AM34<>\"\",AM34<>\"(Q)\"),VLOOKUP(AM34,$Q$11:$R$200,2,0),\"\"),IF(AM34=J34,\"[/b]\",\"\"),\"..... vs \",IF(AN34=J34,\"[b]\",\"\"),AN34,IF(AND(AN34<>\"\",AN34<>\"(Q)\"),VLOOKUP(AN34,$Q$11:$R$200,2,0),\"\"),IF(AN34=J34,\"[/b]\",\"\"),\"..... ( \",IF(AM34=J34,\"[b]\",\"\"),Коэффициенты!F34,IF(AM34=J34,\"[/b]\",\"\"),\" - \",IF(AN34=J34,\"[b]\",\"\"),Коэффициенты!G34,IF(AN34=J34,\"[/b]\",\"\"),\" )\",IF(J34=\"\",$M$13,\"\"))),\"\"),\"\")","v":{"$error":"#N/A"}},null,null,null,null,null,null,null,null,null,null,{"$f":"IF(Коэффициенты!L34<>\"\",Коэффициенты!L34,\"\")","v":24},{"$f":"IF(Коэффициенты!M34<>\"\",Коэффициенты!M34,\"\")","v":"A. Dolgopolov"},null,null,null,null,null,null,null,null,null,null,null,null,null,null,null,null,null,null,null,null,null,{"$f":"IF(Коэффициенты!D34<>\"\",Коэффициенты!D34,\"\")","v":0},{"$f":"IF(Коэффициенты!E34<>\"\",Коэффициенты!E34,\"\")","v":0},"…"]
[null,{"$f":"IF(Коэффициенты!B35<>\"\",Коэффициенты!B35,\"\")","v":""},"",{"$f":"IF(Коэффициенты!C35<>\"\",Коэффициенты!C35,\"\")","v":10},{"$f":"IF(AND(AM35<>\"\",AN35<>\"\"),IF(OR(AM35<>\"\",AN35<>\"\"),IF(AN35=\"bye\",CONCATENATE($M$16,AM35,IF(AND(AM35<>\"\",AM35<>\"(Q)\"),VLOOKUP(AM35,$Q$11:$R$200,2,0),\"\"),\"..... vs \",AN35,$M$17),CONCATENATE(IF(J35=\"\",$M$12,\"\"),IF(AM35=J35,\"[b]\",\"\"),AM35,IF(AND(AM35<>\"\",AM35<>\"(Q)\"),VLOOKUP(AM35,$Q$11:$R$200,2,0),\"\"),IF(AM35=J35,\"[/b]\",\"\"),\"..... vs \",IF(AN35=J35,\"[b]\",\"\"),AN35,IF(AND(AN35<>\"\",AN35<>\"(Q)\"),VLOOKUP(AN35,$Q$11:$R$200,2,0),\"\"),IF(AN35=J35,\"[/b]\",\"\"),\"..... ( \",IF(AM35=J35,\"[b]\",\"\"),Коэффициенты!F35,IF(AM35=J35,\"[/b]\",\"\"),\" - \",IF(AN35=J35,\"[b]\",\"\"),Коэффициенты!G35,IF(AN35=J35,\"[/b]\",\"\"),\" )\",IF(J35=\"\",$M$13,\"\"))),\"\"),\"\")","v":{"$error":"#N/A"}},null,null,null,null,null,null,null,null,null,null,{"$f":"IF(Коэффициенты!L35<>\"\",Коэффициенты!L35,\"\")","v":25},{"$f":"IF(Коэффициенты!M35<>\"\",Коэффициенты!M35,\"\")","v":"R. Stepanek"},null,null,null,null,null,null,null,null,null,null,null,null,null,null,null,null,null,null,null,null,null,{"$f":"IF(Коэффициенты!D35<>\"\",Коэффициенты!D35,\"\")","v":0},{"$f":"IF(Коэффициенты!E35<>\"\",Коэффициенты!E35,\"\")","v":0},"…"]
[null,{"$f":"IF(Коэффициенты!B36<>\"\",Коэффициенты!B36,\"\")","v":""},"",{"$f":"IF(Коэффициенты!C36<>\"\",Коэффициенты!C36,\"\")","v":11},{"$f":"IF(AND(AM36<>\"\",AN36<>\"\"),IF(OR(AM36<>\"\",AN36<>\"\"),IF(AN36=\"bye\",CONCATENATE($M$16,AM36,IF(AND(AM36<>\"\",AM36<>\"(Q)\"),VLOOKUP(AM36,$Q$11:$R$200,2,0),\"\"),\"..... vs \",AN36,$M$17),CONCATENATE(IF(J36=\"\",$M$12,\"\"),IF(AM36=J36,\"[b]\",\"\"),AM36,IF(AND(AM36<>\"\",AM36<>\"(Q)\"),VLOOKUP(AM36,$Q$11:$R$200,2,0),\"\"),IF(AM36=J36,\"[/b]\",\"\"),\"..... vs \",IF(AN36=J36,\"[b]\",\"\"),AN36,IF(AND(AN36<>\"\",AN36<>\"(Q)\"),VLOOKUP(AN36,$Q$11:$R$200,2,0),\"\"),IF(AN36=J36,\"[/b]\",\"\"),\"..... ( \",IF(AM36=J36,\"[b]\",\"\"),Коэффициенты!F36,IF(AM36=J36,\"[/b]\",\"\"),\" - \",IF(AN36=J36,\"[b]\",\"\"),Коэффициенты!G36,IF(AN36=J36,\"[/b]\",\"\"),\" )\",IF(J36=\"\",$M$13,\"\"))),\"\"),\"\")","v":{"$error":"#N/A"}},null,null,null,null,null,null,null,null,null,null,{"$f":"IF(Коэффициенты!L36<>\"\",Коэффициенты!L36,\"\")","v":26},{"$f":"IF(Коэффициенты!M36<>\"\",Коэффициенты!M36,\"\")","v":"M. Granollers"},null,null,null,null,null,null,null,null,null,null,null,null,null,null,null,null,null,null,null,null,null,{"$f":"IF(Коэффициенты!D36<>\"\",Коэффициенты!D36,\"\")","v":0},{"$f":"IF(Коэффициенты!E36<>\"\",Коэффициенты!E36,\"\")","v":0},"…"]
[null,{"$f":"IF(Коэффициенты!B37<>\"\",Коэффициенты!B37,\"\")","v":""},"",{"$f":"IF(Коэффициенты!C37<>\"\",Коэффициенты!C37,\"\")","v":12},{"$f":"IF(AND(AM37<>\"\",AN37<>\"\"),IF(OR(AM37<>\"\",AN37<>\"\"),IF(AN37=\"bye\",CONCATENATE($M$16,AM37,IF(AND(AM37<>\"\",AM37<>\"(Q)\"),VLOOKUP(AM37,$Q$11:$R$200,2,0),\"\"),\"..... vs \",AN37,$M$17),CONCATENATE(IF(J37=\"\",$M$12,\"\"),IF(AM37=J37,\"[b]\",\"\"),AM37,IF(AND(AM37<>\"\",AM37<>\"(Q)\"),VLOOKUP(AM37,$Q$11:$R$200,2,0),\"\"),IF(AM37=J37,\"[/b]\",\"\"),\"..... vs \",IF(AN37=J37,\"[b]\",\"\"),AN37,IF(AND(AN37<>\"\",AN37<>\"(Q)\"),VLOOKUP(AN37,$Q$11:$R$200,2,0),\"\"),IF(AN37=J37,\"[/b]\",\"\"),\"..... ( \",IF(AM37=J37,\"[b]\",\"\"),Коэффициенты!F37,IF(AM37=J37,\"[/b]\",\"\"),\" - \",IF(AN37=J37,\"[b]\",\"\"),Коэффициенты!G37,IF(AN37=J37,\"[/b]\",\"\"),\" )\",IF(J37=\"\",$M$13,\"\"))),\"\"),\"\")","v":{"$error":"#N/A"}},null,null,null,null,null,null,null,null,null,null,{"$f":"IF(Коэффициенты!L37<>\"\",Коэффициенты!L37,\"\")","v":27},{"$f":"IF(Коэффициенты!M37<>\"\",Коэффициенты!M37,\"\")","v":"A. Seppi"},null,null,null,null,null,null,null,null,null,null,null,null,null,null,null,null,null,null,null,null,null,{"$f":"IF(Коэффициенты!D37<>\"\",Коэффициенты!D37,\"\")","v":0},{"$f":"IF(Коэффициенты!E37<>\"\",Коэффициенты!E37,\"\")","v":0},"…"]
[null,{"$f":"IF(Коэффициенты!B38<>\"\",Коэффициенты!B38,\"\")","v":""},"",{"$f":"IF(Коэффициенты!C38<>\"\",Коэффициенты!C38,\"\")","v":13},{"$f":"IF(AND(AM38<>\"\",AN38<>\"\"),IF(OR(AM38<>\"\",AN38<>\"\"),IF(AN38=\"bye\",CONCATENATE($M$16,AM38,IF(AND(AM38<>\"\",AM38<>\"(Q)\"),VLOOKUP(AM38,$Q$11:$R$200,2,0),\"\"),\"..... vs \",AN38,$M$17),CONCATENATE(IF(J38=\"\",$M$12,\"\"),IF(AM38=J38,\"[b]\",\"\"),AM38,IF(AND(AM38<>\"\",AM38<>\"(Q)\"),VLOOKUP(AM38,$Q$11:$R$200,2,0),\"\"),IF(AM38=J38,\"[/b]\",\"\"),\"..... vs \",IF(AN38=J38,\"[b]\",\"\"),AN38,IF(AND(AN38<>\"\",AN38<>\"(Q)\"),VLOOKUP(AN38,$Q$11:$R$200,2,0),\"\"),IF(AN38=J38,\"[/b]\",\"\"),\"..... ( \",IF(AM38=J38,\"[b]\",\"\"),Коэффициенты!F38,IF(AM38=J38,\"[/b]\",\"\"),\" - \",IF(AN38=J38,\"[b]\",\"\"),Коэффициенты!G38,IF(AN38=J38,\"[/b]\",\"\"),\" )\",IF(J38=\"\",$M$13,\"\"))),\"\"),\"\")","v":{"$error":"#N/A"}},null,null,null,null,null,null,null,null,null,null,{"$f":"IF(Коэффициенты!L38<>\"\",Коэффициенты!L38,\"\")","v":28},{"$f":"IF(Коэффициенты!M38<>\"\",Коэффициенты!M38,\"\")","v":"F. Lopez"},null,null,null,null,null,null,null,null,null,null,null,null,null,null,null,null,null,null,null,null,null,{"$f":"IF(Коэффициенты!D38<>\"\",Коэффициенты!D38,\"\")","v":0},{"$f":"IF(Коэффициенты!E38<>\"\",Коэффициенты!E38,\"\")","v":0},"…"]
[null,{"$f":"IF(Коэффициенты!B39<>\"\",Коэффициенты!B39,\"\")","v":""},"",{"$f":"IF(Коэффициенты!C39<>\"\",Коэффициенты!C39,\"\")","v":14},{"$f":"IF(AND(AM39<>\"\",AN39<>\"\"),IF(OR(AM39<>\"\",AN39<>\"\"),IF(AN39=\"bye\",CONCATENATE($M$16,AM39,IF(AND(AM39<>\"\",AM39<>\"(Q)\"),VLOOKUP(AM39,$Q$11:$R$200,2,0),\"\"),\"..... vs \",AN39,$M$17),CONCATENATE(IF(J39=\"\",$M$12,\"\"),IF(AM39=J39,\"[b]\",\"\"),AM39,IF(AND(AM39<>\"\",AM39<>\"(Q)\"),VLOOKUP(AM39,$Q$11:$R$200,2,0),\"\"),IF(AM39=J39,\"[/b]\",\"\"),\"..... vs \",IF(AN39=J39,\"[b]\",\"\"),AN39,IF(AND(AN39<>\"\",AN39<>\"(Q)\"),VLOOKUP(AN39,$Q$11:$R$200,2,0),\"\"),IF(AN39=J39,\"[/b]\",\"\"),\"..... ( \",IF(AM39=J39,\"[b]\",\"\"),Коэффициенты!F39,IF(AM39=J39,\"[/b]\",\"\"),\" - \",IF(AN39=J39,\"[b]\",\"\"),Коэффициенты!G39,IF(AN39=J39,\"[/b]\",\"\"),\" )\",IF(J39=\"\",$M$13,\"\"))),\"\"),\"\")","v":{"$error":"#N/A"}},null,null,null,null,null,null,null,null,null,null,{"$f":"IF(Коэффициенты!L39<>\"\",Коэффициенты!L39,\"\")","v":29},{"$f":"IF(Коэффициенты!M39<>\"\",Коэффициенты!M39,\"\")","v":"V. Troicki"},null,null,null,null,null,null,null,null,null,null,null,null,null,null,null,null,null,null,null,null,null,{"$f":"IF(Коэффициенты!D39<>\"\",Коэффициенты!D39,\"\")","v":0},{"$f":"IF(Коэффициенты!E39<>\"\",Коэффициенты!E39,\"\")","v":0},"…"]
[null,{"$f":"IF(Коэффициенты!B40<>\"\",Коэффициенты!B40,\"\")","v":""},"",{"$f":"IF(Коэффициенты!C40<>\"\",Коэффициенты!C40,\"\")","v":15},{"$f":"IF(AND(AM40<>\"\",AN40<>\"\"),IF(OR(AM40<>\"\",AN40<>\"\"),IF(AN40=\"bye\",CONCATENATE($M$16,AM40,IF(AND(AM40<>\"\",AM40<>\"(Q)\"),VLOOKUP(AM40,$Q$11:$R$200,2,0),\"\"),\"..... vs \",AN40,$M$17),CONCATENATE(IF(J40=\"\",$M$12,\"\"),IF(AM40=J40,\"[b]\",\"\"),AM40,IF(AND(AM40<>\"\",AM40<>\"(Q)\"),VLOOKUP(AM40,$Q$11:$R$200,2,0),\"\"),IF(AM40=J40,\"[/b]\",\"\"),\"..... vs \",IF(AN40=J40,\"[b]\",\"\"),AN40,IF(AND(AN40<>\"\",AN40<>\"(Q)\"),VLOOKUP(AN40,$Q$11:$R$200,2,0),\"\"),IF(AN40=J40,\"[/b]\",\"\"),\"..... ( \",IF(AM40=J40,\"[b]\",\"\"),Коэффициенты!F40,IF(AM40=J40,\"[/b]\",\"\"),\" - \",IF(AN40=J40,\"[b]\",\"\"),Коэффициенты!G40,IF(AN40=J40,\"[/b]\",\"\"),\" )\",IF(J40=\"\",$M$13,\"\"))),\"\"),\"\")","v":{"$error":"#N/A"}},null,null,null,null,null,null,null,null,null,null,{"$f":"IF(Коэффициенты!L40<>\"\",Коэффициенты!L40,\"\")","v":30},{"$f":"IF(Коэффициенты!M40<>\"\",Коэффициенты!M40,\"\")","v":"M. Youzhny"},null,null,null,null,null,null,null,null,null,null,null,null,null,null,null,null,null,null,null,null,null,{"$f":"IF(Коэффициенты!D40<>\"\",Коэффициенты!D40,\"\")","v":0},{"$f":"IF(Коэффициенты!E40<>\"\",Коэффициенты!E40,\"\")","v":0},"…"]
[null,{"$f":"IF(Коэффициенты!B41<>\"\",Коэффициенты!B41,\"\")","v":""},"",{"$f":"IF(Коэффициенты!C41<>\"\",Коэффициенты!C41,\"\")","v":16},{"$f":"IF(AND(AM41<>\"\",AN41<>\"\"),IF(OR(AM41<>\"\",AN41<>\"\"),IF(AN41=\"bye\",CONCATENATE($M$16,AM41,IF(AND(AM41<>\"\",AM41<>\"(Q)\"),VLOOKUP(AM41,$Q$11:$R$200,2,0),\"\"),\"..... vs \",AN41,$M$17),CONCATENATE(IF(J41=\"\",$M$12,\"\"),IF(AM41=J41,\"[b]\",\"\"),AM41,IF(AND(AM41<>\"\",AM41<>\"(Q)\"),VLOOKUP(AM41,$Q$11:$R$200,2,0),\"\"),IF(AM41=J41,\"[/b]\",\"\"),\"..... vs \",IF(AN41=J41,\"[b]\",\"\"),AN41,IF(AND(AN41<>\"\",AN41<>\"(Q)\"),VLOOKUP(AN41,$Q$11:$R$200,2,0),\"\"),IF(AN41=J41,\"[/b]\",\"\"),\"..... ( \",IF(AM41=J41,\"[b]\",\"\"),Коэффициенты!F41,IF(AM41=J41,\"[/b]\",\"\"),\" - \",IF(AN41=J41,\"[b]\",\"\"),Коэффициенты!G41,IF(AN41=J41,\"[/b]\",\"\"),\" )\",IF(J41=\"\",$M$13,\"\"))),\"\"),\"\")","v":{"$error":"#N/A"}},null,null,null,null,null,null,null,null,null,null,{"$f":"IF(Коэффициенты!L41<>\"\",Коэффициенты!L41,\"\")","v":31},{"$f":"IF(Коэффициенты!M41<>\"\",Коэффициенты!M41,\"\")","v":"J. Benneteau"},null,null,null,null,null,null,null,null,null,null,null,null,null,null,null,null,null,null,null,null,null,{"$f":"IF(Коэффициенты!D41<>\"\",Коэффициенты!D41,\"\")","v":0},{"$f":"IF(Коэффициенты!E41<>\"\",Коэффициенты!E41,\"\")","v":0},"…"]
[null,{"$f":"IF(Коэффициенты!B42<>\"\",Коэффициенты!B42,\"\")","v":"Первый круг"},"[size=11][color=#00BFFF][b]Первый круг[/b][/color][/size]",{"$f":"IF(Коэффициенты!C42<>\"\",Коэффициенты!C42,\"\")","v":1},{"$f":"IF(AND(AM42<>\"\",AN42<>\"\"),IF(OR(AM42<>\"\",AN42<>\"\"),IF(AN42=\"bye\",CONCATENATE($M$16,AM42,IF(AND(AM42<>\"\",AM42<>\"(Q)\"),VLOOKUP(AM42,$Q$11:$R$200,2,0),\"\"),\"..... vs \",AN42,$M$17),CONCATENATE(IF(J42=\"\",$M$12,\"\"),IF(AM42=J42,\"[b]\",\"\"),AM42,IF(AND(AM42<>\"\",AM42<>\"(Q)\"),VLOOKUP(AM42,$Q$11:$R$200,2,0),\"\"),IF(AM42=J42,\"[/b]\",\"\"),\"..... vs \",IF(AN42=J42,\"[b]\",\"\"),AN42,IF(AND(AN42<>\"\",AN42<>\"(Q)\"),VLOOKUP(AN42,$Q$11:$R$200,2,0),\"\"),IF(AN42=J42,\"[/b]\",\"\"),\"..... ( \",IF(AM42=J42,\"[b]\",\"\"),Коэффициенты!F42,IF(AM42=J42,\"[/b]\",\"\"),\" - \",IF(AN42=J42,\"[b]\",\"\"),Коэффициенты!G42,IF(AN42=J42,\"[/b]\",\"\"),\" )\",IF(J42=\"\",$M$13,\"\"))),\"\"),\"\")","v":"[color=#BF4040]N. Djokovic(1)..... vs bye[/color]"},null,null,null,null,null,null,null,null,null,null,{"$f":"IF(Коэффициенты!L42<>\"\",Коэффициенты!L42,\"\")","v":32},{"$f":"IF(Коэффициенты!M42<>\"\",Коэффициенты!M42,\"\")","v":"K. Anderson"},null,null,null,null,null,null,null,null,null,null,null,null,null,null,null,null,null,null,null,null,null,{"$f":"IF(Коэффициенты!D42<>\"\",Коэффициенты!D42,\"\")","v":"N. Djokovic"},{"$f":"IF(Коэффициенты!E42<>\"\",Коэффициенты!E42,\"\")","v":"bye"},"…"]
[null,{"$f":"IF(Коэффициенты!B43<>\"\",Коэффициенты!B43,\"\")","v":""},{"$f":"IF(B43<>\"\",CONCATENATE($M$20,B43,$M$21),\"\")","v":""},{"$f":"IF(Коэффициенты!C43<>\"\",Коэффициенты!C43,\"\")","v":2},{"$f":"IF(AND(AM43<>\"\",AN43<>\"\"),IF(OR(AM43<>\"\",AN43<>\"\"),IF(AN43=\"bye\",CONCATENATE($M$16,AM43,IF(AND(AM43<>\"\",AM43<>\"(Q)\"),VLOOKUP(AM43,$Q$11:$R$200,2,0),\"\"),\"..... vs \",AN43,$M$17),CONCATENATE(IF(J43=\"\",$M$12,\"\"),IF(AM43=J43,\"[b]\",\"\"),AM43,IF(AND(AM43<>\"\",AM43<>\"(Q)\"),VLOOKUP(AM43,$Q$11:$R$200,2,0),\"\"),IF(AM43=J43,\"[/b]\",\"\"),\"..... vs \",IF(AN43=J43,\"[b]\",\"\"),AN43,IF(AND(AN43<>\"\",AN43<>\"(Q)\"),VLOOKUP(AN43,$Q$11:$R$200,2,0),\"\"),IF(AN43=J43,\"[/b]\",\"\"),\"..... ( \",IF(AM43=J43,\"[b]\",\"\"),Коэффициенты!F43,IF(AM43=J43,\"[/b]\",\"\"),\" - \",IF(AN43=J43,\"[b]\",\"\"),Коэффициенты!G43,IF(AN43=J43,\"[/b]\",\"\"),\" )\",IF(J43=\"\",$M$13,\"\"))),\"\"),\"\")","v":"[color=#00BF00]M. Berrer(Q)..... vs B. Tomic..... ( 12,5 - 7,5 )[/color]"},null,null,null,null,null,null,null,null,null,null,{"$f":"IF(Коэффициенты!L43<>\"\",Коэффициенты!L43,\"\")","v":33},{"$f":"IF(Коэффициенты!M43<>\"\",Коэффициенты!M43,\"\")","v":"J. Melzer"},null,null,null,null,null,null,null,null,null,null,null,null,null,null,null,null,null,null,null,null,null,{"$f":"IF(Коэффициенты!D43<>\"\",Коэффициенты!D43,\"\")","v":"M. Berrer"},{"$f":"IF(Коэффициенты!E43<>\"\",Коэффициенты!E43,\"\")","v":"B. Tomic"},"…"]
[null,{"$f":"IF(Коэффициенты!B44<>\"\",Коэффициенты!B44,\"\")","v":""},"",{"$f":"IF(Коэффициенты!C44<>\"\",Коэффициенты!C44,\"\")","v":3},{"$f":"IF(AND(AM44<>\"\",AN44<>\"\"),IF(OR(AM44<>\"\",AN44<>\"\"),IF(AN44=\"bye\",CONCATENATE($M$16,AM44,IF(AND(AM44<>\"\",AM44<>\"(Q)\"),VLOOKUP(AM44,$Q$11:$R$200,2,0),\"\"),\"..... vs \",AN44,$M$17),CONCATENATE(IF(J44=\"\",$M$12,\"\"),IF(AM44=J44,\"[b]\",\"\"),AM44,IF(AND(AM44<>\"\",AM44<>\"(Q)\"),VLOOKUP(AM44,$Q$11:$R$200,2,0),\"\"),IF(AM44=J44,\"[/b]\",\"\"),\"..... vs \",IF(AN44=J44,\"[b]\",\"\"),AN44,IF(AND(AN44<>\"\",AN44<>\"(Q)\"),VLOOKUP(AN44,$Q$11:$R$200,2,0),\"\"),IF(AN44=J44,\"[/b]\",\"\"),\"..... ( \",IF(AM44=J44,\"[b]\",\"\"),Коэффициенты!F44,IF(AM44=J44,\"[/b]\",\"\"),\" - \",IF(AN44=J44,\"[b]\",\"\"),Коэффициенты!G44,IF(AN44=J44,\"[/b]\",\"\"),\" )\",IF(J44=\"\",$M$13,\"\"))),\"\"),\"\")","v":"[color=#00BF00]S. Querrey(SE)..... vs J. Melzer..... ( 10 - 10 )[/color]"},null,null,null,null,null,null,null,null,null,null,{"$f":"IF(Коэффициенты!L44<>\"\",Коэффициенты!L44,\"\")","v":34},{"$f":"IF(Коэффициенты!M44<>\"\",Коэффициенты!M44,\"\")","v":"P. Andujar"},null,null,null,null,null,null,null,null,null,null,null,null,null,null,null,null,null,null,null,null,null,{"$f":"IF(Коэффициенты!D44<>\"\",Коэффициенты!D44,\"\")","v":"S. Querrey"},{"$f":"IF(Коэффициенты!E44<>\"\",Коэффициенты!E44,\"\")","v":"J. Melzer"},"…"]
[null,{"$f":"IF(Коэффициенты!B45<>\"\",Коэффициенты!B45,\"\")","v":""},"",{"$f":"IF(Коэффициенты!C45<>\"\",Коэффициенты!C45,\"\")","v":4},{"$f":"IF(AND(AM45<>\"\",AN45<>\"\"),IF(OR(AM45<>\"\",AN45<>\"\"),IF(AN45=\"bye\",CONCATENATE($M$16,AM45,IF(AND(AM45<>\"\",AM45<>\"(Q)\"),VLOOKUP(AM45,$Q$11:$R$200,2,0),\"\"),\"..... vs \",AN45,$M$17),CONCATENATE(IF(J45=\"\",$M$12,\"\"),IF(AM45=J45,\"[b]\",\"\"),AM45,IF(AND(AM45<>\"\",AM45<>\"(Q)\"),VLOOKUP(AM45,$Q$11:$R$200,2,0),\"\"),IF(AM45=J45,\"[/b]\",\"\"),\"..... vs \",IF(AN45=J45,\"[b]\",\"\"),AN45,IF(AND(AN45<>\"\",AN45<>\"(Q)\"),VLOOKUP(AN45,$Q$11:$R$200,2,0),\"\"),IF(AN45=J45,\"[/b]\",\"\"),\"..... ( \",IF(AM45=J45,\"[b]\",\"\"),Коэффициенты!F45,IF(AM45=J45,\"[/b]\",\"\"),\" - \",IF(AN45=J45,\"[b]\",\"\"),Коэффициенты!G45,IF(AN45=J45,\"[/b]\",\"\"),\" )\",IF(J45=\"\",$M$13,\"\"))),\"\"),\"\")","v":"[color=#BF4040]K. Nishikori(13)..... vs bye[/color]"},null,null,null,null,null,null,null,null,null,null,{"$f":"IF(Коэффициенты!L45<>\"\",Коэффициенты!L45,\"\")","v":35},{"$f":"IF(Коэффициенты!M45<>\"\",Коэффициенты!M45,\"\")","v":"C. Berlocq"},null,null,null,null,null,null,null,null,null,null,null,null,null,null,null,null,null,null,null,null,null,{"$f":"IF(Коэффициенты!D45<>\"\",Коэффициенты!D45,\"\")","v":"K. Nishikori"},{"$f":"IF(Коэффициенты!E45<>\"\",Коэффициенты!E45,\"\")","v":"bye"},"…"]
[null,{"$f":"IF(Коэффициенты!B46<>\"\",Коэффициенты!B46,\"\")","v":""},"",{"$f":"IF(Коэффициенты!C46<>\"\",Коэффициенты!C46,\"\")","v":5},{"$f":"IF(AND(AM46<>\"\",AN46<>\"\"),IF(OR(AM46<>\"\",AN46<>\"\"),IF(AN46=\"bye\",CONCATENATE($M$16,AM46,IF(AND(AM46<>\"\",AM46<>\"(Q)\"),VLOOKUP(AM46,$Q$11:$R$200,2,0),\"\"),\"..... vs \",AN46,$M$17),CONCATENATE(IF(J46=\"\",$M$12,\"\"),IF(AM46=J46,\"[b]\",\"\"),AM46,IF(AND(AM46<>\"\",AM46<>\"(Q)\"),VLOOKUP(AM46,$Q$11:$R$200,2,0),\"\"),IF(AM46=J46,\"[/b]\",\"\"),\"..... vs \",IF(AN46=J46,\"[b]\",\"\"),AN46,IF(AND(AN46<>\"\",AN46<>\"(Q)\"),VLOOKUP(AN46,$Q$11:$R$200,2,0),\"\"),IF(AN46=J46,\"[/b]\",\"\"),\"..... ( \",IF(AM46=J46,\"[b]\",\"\"),Коэффициенты!F46,IF(AM46=J46,\"[/b]\",\"\"),\" - \",IF(AN46=J46,\"[b]\",\"\"),Коэффициенты!G46,IF(AN46=J46,\"[/b]\",\"\"),\" )\",IF(J46=\"\",$M$13,\"\"))),\"\"),\"\")","v":"[color=#BF4040]G. Simon(9)..... vs bye[/color]"},null,null,null,null,null,null,null,null,null,null,{"$f":"IF(Коэффициенты!L46<>\"\",Коэффициенты!L46,\"\")","v":36},{"$f":"IF(Коэффициенты!M46<>\"\",Коэффициенты!M46,\"\")","v":"B. Tomic"},null,null,null,null,null,null,null,null,null,null,null,null,null,null,null,null,null,null,null,null,null,{"$f":"IF(Коэффициенты!D46<>\"\",Коэффициенты!D46,\"\")","v":"G. Simon"},{"$f":"IF(Коэффициенты!E46<>\"\",Коэффициенты!E46,\"\")","v":"bye"},"…"]
[null,{"$f":"IF(Коэффициенты!B47<>\"\",Коэффициенты!B47,\"\")","v":""},"",{"$f":"IF(Коэффициенты!C47<>\"\",Коэффициенты!C47,\"\")","v":6},{"$f":"IF(AND(AM47<>\"\",AN47<>\"\"),IF(OR(AM47<>\"\",AN47<>\"\"),IF(AN47=\"bye\",CONCATENATE($M$16,AM47,IF(AND(AM47<>\"\",AM47<>\"(Q)\"),VLOOKUP(AM47,$Q$11:$R$200,2,0),\"\"),\"..... vs \",AN47,$M$17),CONCATENATE(IF(J47=\"\",$M$12,\"\"),IF(AM47=J47,\"[b]\",\"\"),AM47,IF(AND(AM47<>\"\",AM47<>\"(Q)\"),VLOOKUP(AM47,$Q$11:$R$200,2,0),\"\"),IF(AM47=J47,\"[/b]\",\"\"),\"..... vs \",IF(AN47=J47,\"[b]\",\"\"),AN47,IF(AND(AN47<>\"\",AN47<>\"(Q)\"),VLOOKUP(AN47,$Q$11:$R$200,2,0),\"\"),IF(AN47=J47,\"[/b]\",\"\"),\"..... ( \",IF(AM47=J47,\"[b]\",\"\"),Коэффициенты!F47,IF(AM47=J47,\"[/b]\",\"\"),\" - \",IF(AN47=J47,\"[b]\",\"\"),Коэффициенты!G47,IF(AN47=J47,\"[/b]\",\"\"),\" )\",IF(J47=\"\",$M$13,\"\"))),\"\"),\"\")","v":"[color=#00BF00]T. Haas..... vs D. Nalbandian..... ( 9,5 - 10,5 )[/color]"},null,null,null,null,null,null,null,null,null,null,{"$f":"IF(Коэффициенты!L47<>\"\",Коэффициенты!L47,\"\")","v":37},{"$f":"IF(Коэффициенты!M47<>\"\",Коэффициенты!M47,\"\")","v":"J.C. Ferrero"},null,null,null,null,null,null,null,null,null,null,null,null,null,null,null,null,null,null,null,null,null,{"$f":"IF(Коэффициенты!D47<>\"\",Коэффициенты!D47,\"\")","v":"T. Haas"},{"$f":"IF(Коэффициенты!E47<>\"\",Коэффициенты!E47,\"\")","v":"D. Nalbandian"},"…"]
[null,{"$f":"IF(Коэффициенты!B48<>\"\",Коэффициенты!B48,\"\")","v":""},"",{"$f":"IF(Коэффициенты!C48<>\"\",Коэффициенты!C48,\"\")","v":7},{"$f":"IF(AND(AM48<>\"\",AN48<>\"\"),IF(OR(AM48<>\"\",AN48<>\"\"),IF(AN48=\"bye\",CONCATENATE($M$16,AM48,IF(AND(AM48<>\"\",AM48<>\"(Q)\"),VLOOKUP(AM48,$Q$11:$R$200,2,0),\"\"),\"..... vs \",AN48,$M$17),CONCATENATE(IF(J48=\"\",$M$12,\"\"),IF(AM48=J48,\"[b]\",\"\"),AM48,IF(AND(AM48<>\"\",AM48<>\"(Q)\"),VLOOKUP(AM48,$Q$11:$R$200,2,0),\"\"),IF(AM48=J48,\"[/b]\",\"\"),\"..... vs \",IF(AN48=J48,\"[b]\",\"\"),AN48,IF(AND(AN48<>\"\",AN48<>\"(Q)\"),VLOOKUP(AN48,$Q$11:$R$200,2,0),\"\"),IF(AN48=J48,\"[/b]\",\"\"),\"..... ( \",IF(AM48=J48,\"[b]\",\"\"),Коэффициенты!F48,IF(AM48=J48,\"[/b]\",\"\"),\" - \",IF(AN48=J48,\"[b]\",\"\"),Коэффициенты!G48,IF(AN48=J48,\"[/b]\",\"\"),\" )\",IF(J48=\"\",$M$13,\"\"))),\"\"),\"\")","v":"[color=#00BF00]R. Stepanek..... vs A. Dolgopolov..... ( 10 - 10 )[/color]"},null,null,null,null,null,null,null,null,null,null,{"$f":"IF(Коэффициенты!L48<>\"\",Коэффициенты!L48,\"\")","v":38},{"$f":"IF(Коэффициенты!M48<>\"\",Коэффициенты!M48,\"\")","v":"S. Querrey"},"(SE)",null,null,null,null,null,null,null,null,null,null,null,null,null,null,null,null,null,null,null,null,{"$f":"IF(Коэффициенты!D48<>\"\",Коэффициенты!D48,\"\")","v":"R. Stepanek"},{"$f":"IF(Коэффициенты!E48<>\"\",Коэффициенты!E48,\"\")","v":"A. Dolgopolov"},"…"]
[null,{"$f":"IF(Коэффициенты!B49<>\"\",Коэффициенты!B49,\"\")","v":""},"",{"$f":"IF(Коэффициенты!C49<>\"\",Коэффициенты!C49,\"\")","v":8},{"$f":"IF(AND(AM49<>\"\",AN49<>\"\"),IF(OR(AM49<>\"\",AN49<>\"\"),IF(AN49=\"bye\",CONCATENATE($M$16,AM49,IF(AND(AM49<>\"\",AM49<>\"(Q)\"),VLOOKUP(AM49,$Q$11:$R$200,2,0),\"\"),\"..... vs \",AN49,$M$17),CONCATENATE(IF(J49=\"\",$M$12,\"\"),IF(AM49=J49,\"[b]\",\"\"),AM49,IF(AND(AM49<>\"\",AM49<>\"(Q)\"),VLOOKUP(AM49,$Q$11:$R$200,2,0),\"\"),IF(AM49=J49,\"[/b]\",\"\"),\"..... vs \",IF(AN49=J49,\"[b]\",\"\"),AN49,IF(AND(AN49<>\"\",AN49<>\"(Q)\"),VLOOKUP(AN49,$Q$11:$R$200,2,0),\"\"),IF(AN49=J49,\"[/b]\",\"\"),\"..... ( \",IF(AM49=J49,\"[b]\",\"\"),Коэффициенты!F49,IF(AM49=J49,\"[/b]\",\"\"),\" - \",IF(AN49=J49,\"[b]\",\"\"),Коэффициенты!G49,IF(AN49=J49,\"[/b]\",\"\"),\" )\",IF(J49=\"\",$M$13,\"\"))),\"\"),\"\")","v":"[color=#BF4040]J.M. Del Potro(6)..... vs bye[/color]"},null,null,null,null,null,null,null,null,null,null,{"$f":"IF(Коэффициенты!L49<>\"\",Коэффициенты!L49,\"\")","v":39},{"$f":"IF(Коэффициенты!M49<>\"\",Коэффициенты!M49,\"\")","v":"J. Chardy"},null,null,null,null,null,null,null,null,null,null,null,null,null,null,null,null,null,null,null,null,null,{"$f":"IF(Коэффициенты!D49<>\"\",Коэффициенты!D49,\"\")","v":"J.M. Del Potro"},{"$f":"IF(Коэффициенты!E49<>\"\",Коэффициенты!E49,\"\")","v":"bye"},"…"]
[null,{"$f":"IF(Коэффициенты!B50<>\"\",Коэффициенты!B50,\"\")","v":""},"",{"$f":"IF(Коэффициенты!C50<>\"\",Коэффициенты!C50,\"\")","v":9},{"$f":"IF(AND(AM50<>\"\",AN50<>\"\"),IF(OR(AM50<>\"\",AN50<>\"\"),IF(AN50=\"bye\",CONCATENATE($M$16,AM50,IF(AND(AM50<>\"\",AM50<>\"(Q)\"),VLOOKUP(AM50,$Q$11:$R$200,2,0),\"\"),\"..... vs \",AN50,$M$17),CONCATENATE(IF(J50=\"\",$M$12,\"\"),IF(AM50=J50,\"[b]\",\"\"),AM50,IF(AND(AM50<>\"\",AM50<>\"(Q)\"),VLOOKUP(AM50,$Q$11:$R$200,2,0),\"\"),IF(AM50=J50,\"[/b]\",\"\"),\"..... vs \",IF(AN50=J50,\"[b]\",\"\"),AN50,IF(AND(AN50<>\"\",AN50<>\"(Q)\"),VLOOKUP(AN50,$Q$11:$R$200,2,0),\"\"),IF(AN50=J50,\"[/b]\",\"\"),\"..... ( \",IF(AM50=J50,\"[b]\",\"\"),Коэффициенты!F50,IF(AM50=J50,\"[/b]\",\"\"),\" - \",IF(AN50=J50,\"[b]\",\"\"),Коэффициенты!G50,IF(AN50=J50,\"[/b]\",\"\"),\" )\",IF(J50=\"\",$M$13,\"\"))),\"\"),\"\")","v":"[color=#BF4040]J.-W. Tsonga(3)..... vs bye[/color]"},null,null,null,null,null,null,null,null,null,null,{"$f":"IF(Коэффициенты!L50<>\"\",Коэффициенты!L50,\"\")","v":40},{"$f":"IF(Коэффициенты!M50<>\"\",Коэффициенты!M50,\"\")","v":"V. Pospisil"},"(WC)",null,null,null,null,null,null,null,null,null,null,null,null,null,null,null,null,null,null,null,null,{"$f":"IF(Коэффициенты!D50<>\"\",Коэффициенты!D50,\"\")","v":"J.-W. Tsonga"},{"$f":"IF(Коэффициенты!E50<>\"\",Коэффициенты!E50,\"\")","v":"bye"},"…"]
[null,{"$f":"IF(Коэффициенты!B51<>\"\",Коэффициенты!B51,\"\")","v":""},"",{"$f":"IF(Коэффициенты!C51<>\"\",Коэффициенты!C51,\"\")","v":10},{"$f":"IF(AND(AM51<>\"\",AN51<>\"\"),IF(OR(AM51<>\"\",AN51<>\"\"),IF(AN51=\"bye\",CONCATENATE($M$16,AM51,IF(AND(AM51<>\"\",AM51<>\"(Q)\"),VLOOKUP(AM51,$Q$11:$R$200,2,0),\"\"),\"..... vs \",AN51,$M$17),CONCATENATE(IF(J51=\"\",$M$12,\"\"),IF(AM51=J51,\"[b]\",\"\"),AM51,IF(AND(AM51<>\"\",AM51<>\"(Q)\"),VLOOKUP(AM51,$Q$11:$R$200,2,0),\"\"),IF(AM51=J51,\"[/b]\",\"\"),\"..... vs \",IF(AN51=J51,\"[b]\",\"\"),AN51,IF(AND(AN51<>\"\",AN51<>\"(Q)\"),VLOOKUP(AN51,$Q$11:$R$200,2,0),\"\"),IF(AN51=J51,\"[/b]\",\"\"),\"..... ( \",IF(AM51=J51,\"[b]\",\"\"),Коэффициенты!F51,IF(AM51=J51,\"[/b]\",\"\"),\" - \",IF(AN51=J51,\"[b]\",\"\"),Коэффициенты!G51,IF(AN51=J51,\"[/b]\",\"\"),\" )\",IF(J51=\"\",$M$13,\"\"))),\"\"),\"\")","v":"[color=#00BF00]J. Chardy..... vs D. Young..... ( 9,5 - 10,5 )[/color]"},null,null,null,null,null,null,null,null,null,null,{"$f":"IF(Коэффициенты!L51<>\"\",Коэффициенты!L51,\"\")","v":41},{"$f":"IF(Коэффициенты!M51<>\"\",Коэффициенты!M51,\"\")","v":"P. Polansky"},"(WC)",null,null,null,null,null,null,null,null,null,null,null,null,null,null,null,null,null,null,null,null,{"$f":"IF(Коэффициенты!D51<>\"\",Коэффициенты!D51,\"\")","v":"J. Chardy"},{"$f":"IF(Коэффициенты!E51<>\"\",Коэффициенты!E51,\"\")","v":"D. Young"},"…"]
[null,{"$f":"IF(Коэффициенты!B52<>\"\",Коэффициенты!B52,\"\")","v":""},"",{"$f":"IF(Коэффициенты!C52<>\"\",Коэффициенты!C52,\"\")","v":11},{"$f":"IF(AND(AM52<>\"\",AN52<>\"\"),IF(OR(AM52<>\"\",AN52<>\"\"),IF(AN52=\"bye\",CONCATENATE($M$16,AM52,IF(AND(AM52<>\"\",AM52<>\"(Q)\"),VLOOKUP(AM52,$Q$11:$R$200,2,0),\"\"),\"..... vs \",AN52,$M$17),CONCATENATE(IF(J52=\"\",$M$12,\"\"),IF(AM52=J52,\"[b]\",\"\"),AM52,IF(AND(AM52<>\"\",AM52<>\"(Q)\"),VLOOKUP(AM52,$Q$11:$R$200,2,0),\"\"),IF(AM52=J52,\"[/b]\",\"\"),\"..... vs \",IF(AN52=J52,\"[b]\",\"\"),AN52,IF(AND(AN52<>\"\",AN52<>\"(Q)\"),VLOOKUP(AN52,$Q$11:$R$200,2,0),\"\"),IF(AN52=J52,\"[/b]\",\"\"),\"..... ( \",IF(AM52=J52,\"[b]\",\"\"),Коэффициенты!F52,IF(AM52=J52,\"[/b]\",\"\"),\" - \",IF(AN52=J52,\"[b]\",\"\"),Коэффициенты!G52,IF(AN52=J52,\"[/b]\",\"\"),\" )\",IF(J52=\"\",$M$13,\"\"))),\"\"),\"\")","v":"[color=#00BF00]S. Stakhovsky(Q)..... vs M. Granollers..... ( 13,5 - 6,5 )[/color]"},null,null,null,null,null,null,null,null,null,null,{"$f":"IF(Коэффициенты!L52<>\"\",Коэффициенты!L52,\"\")","v":42},{"$f":"IF(Коэффициенты!M52<>\"\",Коэффициенты!M52,\"\")","v":"F. Dancevic"},"(WC)",null,null,null,null,null,null,null,null,null,null,null,null,null,null,null,null,null,null,null,null,{"$f":"IF(Коэффициенты!D52<>\"\",Коэффициенты!D52,\"\")","v":"S. Stakhovsky"},{"$f":"IF(Коэффициенты!E52<>\"\",Коэффициенты!E52,\"\")","v":"M. Granollers"},"…"]
[null,{"$f":"IF(Коэффициенты!B53<>\"\",Коэффициенты!B53,\"\")","v":""},"",{"$f":"IF(Коэффициенты!C53<>\"\",Коэффициенты!C53,\"\")","v":12},{"$f":"IF(AND(AM53<>\"\",AN53<>\"\"),IF(OR(AM53<>\"\",AN53<>\"\"),IF(AN53=\"bye\",CONCATENATE($M$16,AM53,IF(AND(AM53<>\"\",AM53<>\"(Q)\"),VLOOKUP(AM53,$Q$11:$R$200,2,0),\"\"),\"..... vs \",AN53,$M$17),CONCATENATE(IF(J53=\"\",$M$12,\"\"),IF(AM53=J53,\"[b]\",\"\"),AM53,IF(AND(AM53<>\"\",AM53<>\"(Q)\"),VLOOKUP(AM53,$Q$11:$R$200,2,0),\"\"),IF(AM53=J53,\"[/b]\",\"\"),\"..... vs \",IF(AN53=J53,\"[b]\",\"\"),AN53,IF(AND(AN53<>\"\",AN53<>\"(Q)\"),VLOOKUP(AN53,$Q$11:$R$200,2,0),\"\"),IF(AN53=J53,\"[/b]\",\"\"),\"..... ( \",IF(AM53=J53,\"[b]\",\"\"),Коэффициенты!F53,IF(AM53=J53,\"[/b]\",\"\"),\" - \",IF(AN53=J53,\"[b]\",\"\"),Коэффициенты!G53,IF(AN53=J53,\"[/b]\",\"\"),\" )\",IF(J53=\"\",$M$13,\"\"))),\"\"),\"\")","v":"[color=#BF4040]F. Mayer(15)..... vs bye[/color]"},null,null,null,null,null,null,null,null,null,null,{"$f":"IF(Коэффициенты!L53<>\"\",Коэффициенты!L53,\"\")","v":43},{"$f":"IF(Коэффициенты!M53<>\"\",Коэффициенты!M53,\"\")","v":"L. Lacko"},null,null,null,null,null,null,null,null,null,null,null,null,null,null,null,null,null,null,null,null,null,{"$f":"IF(Коэффициенты!D53<>\"\",Коэффициенты!D53,\"\")","v":"F. Mayer"},{"$f":"IF(Коэффициенты!E53<>\"\",Коэффициенты!E53,\"\")","v":"bye"},"…"]
[null,{"$f":"IF(Коэффициенты!B54<>\"\",Коэффициенты!B54,\"\")","v":""},"",{"$f":"IF(Коэффициенты!C54<>\"\",Коэффициенты!C54,\"\")","v":13},{"$f":"IF(AND(AM54<>\"\",AN54<>\"\"),IF(OR(AM54<>\"\",AN54<>\"\"),IF(AN54=\"bye\",CONCATENATE($M$16,AM54,IF(AND(AM54<>\"\",AM54<>\"(Q)\"),VLOOKUP(AM54,$Q$11:$R$200,2,0),\"\"),\"..... vs \",AN54,$M$17),CONCATENATE(IF(J54=\"\",$M$12,\"\"),IF(AM54=J54,\"[b]\",\"\"),AM54,IF(AND(AM54<>\"\",AM54<>\"(Q)\"),VLOOKUP(AM54,$Q$11:$R$200,2,0),\"\"),IF(AM54=J54,\"[/b]\",\"\"),\"..... vs \",IF(AN54=J54,\"[b]\",\"\"),AN54,IF(AND(AN54<>\"\",AN54<>\"(Q)\"),VLOOKUP(AN54,$Q$11:$R$200,2,0),\"\"),IF(AN54=J54,\"[/b]\",\"\"),\"..... ( \",IF(AM54=J54,\"[b]\",\"\"),Коэффициенты!F54,IF(AM54=J54,\"[/b]\",\"\"),\" - \",IF(AN54=J54,\"[b]\",\"\"),Коэффициенты!G54,IF(AN54=J54,\"[/b]\",\"\"),\" )\",IF(J54=\"\",$M$13,\"\"))),\"\"),\"\")","v":"[color=#BF4040]M. Cilic(10)..... vs bye[/color]"},null,null,null,null,null,null,null,null,null,null,{"$f":"IF(Коэффициенты!L54<>\"\",Коэффициенты!L54,\"\")","v":44},{"$f":"IF(Коэффициенты!M54<>\"\",Коэффициенты!M54,\"\")","v":"Y.-H. Lu"},null,null,null,null,null,null,null,null,null,null,null,null,null,null,null,null,null,null,null,null,null,{"$f":"IF(Коэффициенты!D54<>\"\",Коэффициенты!D54,\"\")","v":"M. Cilic"},{"$f":"IF(Коэффициенты!E54<>\"\",Коэффициенты!E54,\"\")","v":"bye"},"…"]
[null,{"$f":"IF(Коэффициенты!B55<>\"\",Коэффициенты!B55,\"\")","v":""},"",{"$f":"IF(Коэффициенты!C55<>\"\",Коэффициенты!C55,\"\")","v":14},{"$f":"IF(AND(AM55<>\"\",AN55<>\"\"),IF(OR(AM55<>\"\",AN55<>\"\"),IF(AN55=\"bye\",CONCATENATE($M$16,AM55,IF(AND(AM55<>\"\",AM55<>\"(Q)\"),VLOOKUP(AM55,$Q$11:$R$200,2,0),\"\"),\"..... vs \",AN55,$M$17),CONCATENATE(IF(J55=\"\",$M$12,\"\"),IF(AM55=J55,\"[b]\",\"\"),AM55,IF(AND(AM55<>\"\",AM55<>\"(Q)\"),VLOOKUP(AM55,$Q$11:$R$200,2,0),\"\"),IF(AM55=J55,\"[/b]\",\"\"),\"..... vs \",IF(AN55=J55,\"[b]\",\"\"),AN55,IF(AND(AN55<>\"\",AN55<>\"(Q)\"),VLOOKUP(AN55,$Q$11:$R$200,2,0),\"\"),IF(AN55=J55,\"[/b]\",\"\"),\"..... ( \",IF(AM55=J55,\"[b]\",\"\"),Коэффициенты!F55,IF(AM55=J55,\"[/b]\",\"\"),\" - \",IF(AN55=J55,\"[b]\",\"\"),Коэффициенты!G55,IF(AN55=J55,\"[/b]\",\"\"),\" )\",IF(J55=\"\",$M$13,\"\"))),\"\"),\"\")","v":"[color=#00BF00]C. Berlocq..... vs M. Baghdatis..... ( 9,5 - 10,5 )[/color]"},null,null,null,null,null,null,null,null,null,null,{"$f":"IF(Коэффициенты!L55<>\"\",Коэффициенты!L55,\"\")","v":45},{"$f":"IF(Коэффициенты!M55<>\"\",Коэффициенты!M55,\"\")","v":"M. Berrer"},"(Q)",null,null,null,null,null,null,null,null,null,null,null,null,null,null,null,null,null,null,null,null,{"$f":"IF(Коэффициенты!D55<>\"\",Коэффициенты!D55,\"\")","v":"C. Berlocq"},{"$f":"IF(Коэффициенты!E55<>\"\",Коэффициенты!E55,\"\")","v":"M. Baghdatis"},"…"]
[null,{"$f":"IF(Коэффициенты!B56<>\"\",Коэффициенты!B56,\"\")","v":""},"",{"$f":"IF(Коэффициенты!C56<>\"\",Коэффициенты!C56,\"\")","v":15},{"$f":"IF(AND(AM56<>\"\",AN56<>\"\"),IF(OR(AM56<>\"\",AN56<>\"\"),IF(AN56=\"bye\",CONCATENATE($M$16,AM56,IF(AND(AM56<>\"\",AM56<>\"(Q)\"),VLOOKUP(AM56,$Q$11:$R$200,2,0),\"\"),\"..... vs \",AN56,$M$17),CONCATENATE(IF(J56=\"\",$M$12,\"\"),IF(AM56=J56,\"[b]\",\"\"),AM56,IF(AND(AM56<>\"\",AM56<>\"(Q)\"),VLOOKUP(AM56,$Q$11:$R$200,2,0),\"\"),IF(AM56=J56,\"[/b]\",\"\"),\"..... vs \",IF(AN56=J56,\"[b]\",\"\"),AN56,IF(AND(AN56<>\"\",AN56<>\"(Q)\"),VLOOKUP(AN56,$Q$11:$R$200,2,0),\"\"),IF(AN56=J56,\"[/b]\",\"\"),\"..... ( \",IF(AM56=J56,\"[b]\",\"\"),Коэффициенты!F56,IF(AM56=J56,\"[/b]\",\"\"),\" - \",IF(AN56=J56,\"[b]\",\"\"),Коэффициенты!G56,IF(AN56=J56,\"[/b]\",\"\"),\" )\",IF(J56=\"\",$M$13,\"\"))),\"\"),\"\")","v":"[color=#00BF00]K. Anderson..... vs M. Youzhny..... ( 10 - 10 )[/color]"},null,null,null,null,null,null,null,null,null,null,{"$f":"IF(Коэффициенты!L56<>\"\",Коэффициенты!L56,\"\")","v":46},{"$f":"IF(Коэффициенты!M56<>\"\",Коэффициенты!M56,\"\")","v":"S. Stakhovsky"},"(Q)",null,null,null,null,null,null,null,null,null,null,null,null,null,null,null,null,null,null,null,null,{"$f":"IF(Коэффициенты!D56<>\"\",Коэффициенты!D56,\"\")","v":"K. Anderson"},{"$f":"IF(Коэффициенты!E56<>\"\",Коэффициенты!E56,\"\")","v":"M. Youzhny"},"…"]
[null,{"$f":"IF(Коэффициенты!B57<>\"\",Коэффициенты!B57,\"\")","v":""},"",{"$f":"IF(Коэффициенты!C57<>\"\",Коэффициенты!C57,\"\")","v":16},{"$f":"IF(AND(AM57<>\"\",AN57<>\"\"),IF(OR(AM57<>\"\",AN57<>\"\"),IF(AN57=\"bye\",CONCATENATE($M$16,AM57,IF(AND(AM57<>\"\",AM57<>\"(Q)\"),VLOOKUP(AM57,$Q$11:$R$200,2,0),\"\"),\"..... vs \",AN57,$M$17),CONCATENATE(IF(J57=\"\",$M$12,\"\"),IF(AM57=J57,\"[b]\",\"\"),AM57,IF(AND(AM57<>\"\",AM57<>\"(Q)\"),VLOOKUP(AM57,$Q$11:$R$200,2,0),\"\"),IF(AM57=J57,\"[/b]\",\"\"),\"..... vs \",IF(AN57=J57,\"[b]\",\"\"),AN57,IF(AND(AN57<>\"\",AN57<>\"(Q)\"),VLOOKUP(AN57,$Q$11:$R$200,2,0),\"\"),IF(AN57=J57,\"[/b]\",\"\"),\"..... ( \",IF(AM57=J57,\"[b]\",\"\"),Коэффициенты!F57,IF(AM57=J57,\"[/b]\",\"\"),\" - \",IF(AN57=J57,\"[b]\",\"\"),Коэффициенты!G57,IF(AN57=J57,\"[/b]\",\"\"),\" )\",IF(J57=\"\",$M$13,\"\"))),\"\"),\"\")","v":"[color=#BF4040]J. Tipsarevic(5)..... vs bye[/color]"},null,null,null,null,null,null,null,null,null,null,{"$f":"IF(Коэффициенты!L57<>\"\",Коэффициенты!L57,\"\")","v":47},{"$f":"IF(Коэффициенты!M57<>\"\",Коэффициенты!M57,\"\")","v":"M. Ebden"},"(LL)",null,null,null,null,null,null,null,null,null,null,null,null,null,null,null,null,null,null,null,null,{"$f":"IF(Коэффициенты!D57<>\"\",Коэффициенты!D57,\"\")","v":"J. Tipsarevic"},{"$f":"IF(Коэффициенты!E57<>\"\",Коэффициенты!E57,\"\")","v":"bye"},"…"]
[null,{"$f":"IF(Коэффициенты!B58<>\"\",Коэффициенты!B58,\"\")","v":""},"",{"$f":"IF(Коэффициенты!C58<>\"\",Коэффициенты!C58,\"\")","v":17},{"$f":"IF(AND(AM58<>\"\",AN58<>\"\"),IF(OR(AM58<>\"\",AN58<>\"\"),IF(AN58=\"bye\",CONCATENATE($M$16,AM58,IF(AND(AM58<>\"\",AM58<>\"(Q)\"),VLOOKUP(AM58,$Q$11:$R$200,2,0),\"\"),\"..... vs \",AN58,$M$17),CONCATENATE(IF(J58=\"\",$M$12,\"\"),IF(AM58=J58,\"[b]\",\"\"),AM58,IF(AND(AM58<>\"\",AM58<>\"(Q)\"),VLOOKUP(AM58,$Q$11:$R$200,2,0),\"\"),IF(AM58=J58,\"[/b]\",\"\"),\"..... vs \",IF(AN58=J58,\"[b]\",\"\"),AN58,IF(AND(AN58<>\"\",AN58<>\"(Q)\"),VLOOKUP(AN58,$Q$11:$R$200,2,0),\"\"),IF(AN58=J58,\"[/b]\",\"\"),\"..... ( \",IF(AM58=J58,\"[b]\",\"\"),Коэффициенты!F58,IF(AM58=J58,\"[/b]\",\"\"),\" - \",IF(AN58=J58,\"[b]\",\"\"),Коэффициенты!G58,IF(AN58=J58,\"[/b]\",\"\"),\" )\",IF(J58=\"\",$M$13,\"\"))),\"\"),\"\")","v":"[color=#BF4040]J. Monaco(7)..... vs bye[/color]"},null,null,null,null,null,null,null,null,null,null,{"$f":"IF(Коэффициенты!L58<>\"\",Коэффициенты!L58,\"\")","v":48},{"$f":"IF(Коэффициенты!M58<>\"\",Коэффициенты!M58,\"\")","v":"W. Odesnik"},"(Q)",null,null,null,null,null,null,null,null,null,null,null,null,null,null,null,null,null,null,null,null,{"$f":"IF(Коэффициенты!D58<>\"\",Коэффициенты!D58,\"\")","v":"J. Monaco"},{"$f":"IF(Коэффициенты!E58<>\"\",Коэффициенты!E58,\"\")","v":"bye"},"…"]
[null,{"$f":"IF(Коэффициенты!B59<>\"\",Коэффициенты!B59,\"\")","v":""},"",{"$f":"IF(Коэффициенты!C59<>\"\",Коэффициенты!C59,\"\")","v":18},{"$f":"IF(AND(AM59<>\"\",AN59<>\"\"),IF(OR(AM59<>\"\",AN59<>\"\"),IF(AN59=\"bye\",CONCATENATE($M$16,AM59,IF(AND(AM59<>\"\",AM59<>\"(Q)\"),VLOOKUP(AM59,$Q$11:$R$200,2,0),\"\"),\"..... vs \",AN59,$M$17),CONCATENATE(IF(J59=\"\",$M$12,\"\"),IF(AM59=J59,\"[b]\",\"\"),AM59,IF(AND(AM59<>\"\",AM59<>\"(Q)\"),VLOOKUP(AM59,$Q$11:$R$200,2,0),\"\"),IF(AM59=J59,\"[/b]\",\"\"),\"..... vs \",IF(AN59=J59,\"[b]\",\"\"),AN59,IF(AND(AN59<>\"\",AN59<>\"(Q)\"),VLOOKUP(AN59,$Q$11:$R$200,2,0),\"\"),IF(AN59=J59,\"[/b]\",\"\"),\"..... ( \",IF(AM59=J59,\"[b]\",\"\"),Коэффициенты!F59,IF(AM59=J59,\"[/b]\",\"\"),\" - \",IF(AN59=J59,\"[b]\",\"\"),Коэффициенты!G59,IF(AN59=J59,\"[/b]\",\"\"),\" )\",IF(J59=\"\",$M$13,\"\"))),\"\"),\"\")","v":"[color=#00BF00]V. Pospisil(WC)..... vs A. Seppi..... ( 13 - 7 )[/color]"},null,null,null,null,null,null,null,null,null,null,{"$f":"IF(Коэффициенты!L59<>\"\",Коэффициенты!L59,\"\")","v":49},{"$f":"IF(Коэффициенты!M59<>\"\",Коэффициенты!M59,\"\")","v":"F. Fognini"},"(Q)",null,null,null,null,null,null,null,null,null,null,null,null,null,null,null,null,null,null,null,null,{"$f":"IF(Коэффициенты!D59<>\"\",Коэффициенты!D59,\"\")","v":"V. Pospisil"},{"$f":"IF(Коэффициенты!E59<>\"\",Коэффициенты!E59,\"\")","v":"A. Seppi"},"…"]
[null,{"$f":"IF(Коэффициенты!B60<>\"\",Коэффициенты!B60,\"\")","v":""},"",{"$f":"IF(Коэффициенты!C60<>\"\",Коэффициенты!C60,\"\")","v":19},{"$f":"IF(AND(AM60<>\"\",AN60<>\"\"),IF(OR(AM60<>\"\",AN60<>\"\"),IF(AN60=\"bye\",CONCATENATE($M$16,AM60,IF(AND(AM60<>\"\",AM60<>\"(Q)\"),VLOOKUP(AM60,$Q$11:$R$200,2,0),\"\"),\"..... vs \",AN60,$M$17),CONCATENATE(IF(J60=\"\",$M$12,\"\"),IF(AM60=J60,\"[b]\",\"\"),AM60,IF(AND(AM60<>\"\",AM60<>\"(Q)\"),VLOOKUP(AM60,$Q$11:$R$200,2,0),\"\"),IF(AM60=J60,\"[/b]\",\"\"),\"..... vs \",IF(AN60=J60,\"[b]\",\"\"),AN60,IF(AND(AN60<>\"\",AN60<>\"(Q)\"),VLOOKUP(AN60,$Q$11:$R$200,2,0),\"\"),IF(AN60=J60,\"[/b]\",\"\"),\"..... ( \",IF(AM60=J60,\"[b]\",\"\"),Коэффициенты!F60,IF(AM60=J60,\"[/b]\",\"\"),\" - \",IF(AN60=J60,\"[b]\",\"\"),Коэффициенты!G60,IF(AN60=J60,\"[/b]\",\"\"),\" )\",IF(J60=\"\",$M$13,\"\"))),\"\"),\"\")","v":"[color=#00BF00]P. Polansky(WC)..... vs M. Ebden(LL)..... ( 12 - 8 )[/color]"},null,null,null,null,null,null,null,null,null,null,{"$f":"IF(Коэффициенты!L60<>\"\",Коэффициенты!L60,\"\")","v":50},{"$f":"IF(Коэффициенты!M60<>\"\",Коэффициенты!M60,\"\")","v":"F. Cipolla"},"(Q)",null,null,null,null,null,null,null,null,null,null,null,null,null,null,null,null,null,null,null,null,{"$f":"IF(Коэффициенты!D60<>\"\",Коэффициенты!D60,\"\")","v":"P. Polansky"},{"$f":"IF(Коэффициенты!E60<>\"\",Коэффициенты!E60,\"\")","v":"M. Ebden"},"…"]
[null,{"$f":"IF(Коэффициенты!B61<>\"\",Коэффициенты!B61,\"\")","v":""},"",{"$f":"IF(Коэффициенты!C61<>\"\",Коэффициенты!C61,\"\")","v":20},{"$f":"IF(AND(AM61<>\"\",AN61<>\"\"),IF(OR(AM61<>\"\",AN61<>\"\"),IF(AN61=\"bye\",CONCATENATE($M$16,AM61,IF(AND(AM61<>\"\",AM61<>\"(Q)\"),VLOOKUP(AM61,$Q$11:$R$200,2,0),\"\"),\"..... vs \",AN61,$M$17),CONCATENATE(IF(J61=\"\",$M$12,\"\"),IF(AM61=J61,\"[b]\",\"\"),AM61,IF(AND(AM61<>\"\",AM61<>\"(Q)\"),VLOOKUP(AM61,$Q$11:$R$200,2,0),\"\"),IF(AM61=J61,\"[/b]\",\"\"),\"..... vs \",IF(AN61=J61,\"[b]\",\"\"),AN61,IF(AND(AN61<>\"\",AN61<>\"(Q)\"),VLOOKUP(AN61,$Q$11:$R$200,2,0),\"\"),IF(AN61=J61,\"[/b]\",\"\"),\"..... ( \",IF(AM61=J61,\"[b]\",\"\"),Коэффициенты!F61,IF(AM61=J61,\"[/b]\",\"\"),\" - \",IF(AN61=J61,\"[b]\",\"\"),Коэффициенты!G61,IF(AN61=J61,\"[/b]\",\"\"),\" )\",IF(J61=\"\",$M$13,\"\"))),\"\"),\"\")","v":"[color=#BF4040]M. Fish(11)..... vs bye[/color]"},null,null,null,null,null,null,null,null,null,null,{"$f":"IF(Коэффициенты!L61<>\"\",Коэффициенты!L61,\"\")","v":51},{"$f":"IF(Коэффициенты!M61<>\"\",Коэффициенты!M61,\"\")","v":"T. Haas"},null,null,null,null,null,null,null,null,null,null,null,null,null,null,null,null,null,null,null,null,null,{"$f":"IF(Коэффициенты!D61<>\"\",Коэффициенты!D61,\"\")","v":"M. Fish"},{"$f":"IF(Коэффициенты!E61<>\"\",Коэффициенты!E61,\"\")","v":"bye"},"…"]
[null,{"$f":"IF(Коэффициенты!B62<>\"\",Коэффициенты!B62,\"\")","v":""},"",{"$f":"IF(Коэффициенты!C62<>\"\",Коэффициенты!C62,\"\")","v":21},{"$f":"IF(AND(AM62<>\"\",AN62<>\"\"),IF(OR(AM62<>\"\",AN62<>\"\"),IF(AN62=\"bye\",CONCATENATE($M$16,AM62,IF(AND(AM62<>\"\",AM62<>\"(Q)\"),VLOOKUP(AM62,$Q$11:$R$200,2,0),\"\"),\"..... vs \",AN62,$M$17),CONCATENATE(IF(J62=\"\",$M$12,\"\"),IF(AM62=J62,\"[b]\",\"\"),AM62,IF(AND(AM62<>\"\",AM62<>\"(Q)\"),VLOOKUP(AM62,$Q$11:$R$200,2,0),\"\"),IF(AM62=J62,\"[/b]\",\"\"),\"..... vs \",IF(AN62=J62,\"[b]\",\"\"),AN62,IF(AND(AN62<>\"\",AN62<>\"(Q)\"),VLOOKUP(AN62,$Q$11:$R$200,2,0),\"\"),IF(AN62=J62,\"[/b]\",\"\"),\"..... ( \",IF(AM62=J62,\"[b]\",\"\"),Коэффициенты!F62,IF(AM62=J62,\"[/b]\",\"\"),\" - \",IF(AN62=J62,\"[b]\",\"\"),Коэффициенты!G62,IF(AN62=J62,\"[/b]\",\"\"),\" )\",IF(J62=\"\",$M$13,\"\"))),\"\"),\"\")","v":"[color=#BF4040]R. Gasquet(14)..... vs bye[/color]"},null,null,null,null,null,null,null,null,null,null,{"$f":"IF(Коэффициенты!L62<>\"\",Коэффициенты!L62,\"\")","v":52},{"$f":"IF(Коэффициенты!M62<>\"\",Коэффициенты!M62,\"\")","v":"D. Nalbandian"},null,null,null,null,null,null,null,null,null,null,null,null,null,null,null,null,null,null,null,null,null,{"$f":"IF(Коэффициенты!D62<>\"\",Коэффициенты!D62,\"\")","v":"R. Gasquet"},{"$f":"IF(Коэффициенты!E62<>\"\",Коэффициенты!E62,\"\")","v":"bye"},"…"]
[null,{"$f":"IF(Коэффициенты!B63<>\"\",Коэффициенты!B63,\"\")","v":""},"",{"$f":"IF(Коэффициенты!C63<>\"\",Коэффициенты!C63,\"\")","v":22},{"$f":"IF(AND(AM63<>\"\",AN63<>\"\"),IF(OR(AM63<>\"\",AN63<>\"\"),IF(AN63=\"bye\",CONCATENATE($M$16,AM63,IF(AND(AM63<>\"\",AM63<>\"(Q)\"),VLOOKUP(AM63,$Q$11:$R$200,2,0),\"\"),\"..... vs \",AN63,$M$17),CONCATENATE(IF(J63=\"\",$M$12,\"\"),IF(AM63=J63,\"[b]\",\"\"),AM63,IF(AND(AM63<>\"\",AM63<>\"(Q)\"),VLOOKUP(AM63,$Q$11:$R$200,2,0),\"\"),IF(AM63=J63,\"[/b]\",\"\"),\"..... vs \",IF(AN63=J63,\"[b]\",\"\"),AN63,IF(AND(AN63<>\"\",AN63<>\"(Q)\"),VLOOKUP(AN63,$Q$11:$R$200,2,0),\"\"),IF(AN63=J63,\"[/b]\",\"\"),\"..... ( \",IF(AM63=J63,\"[b]\",\"\"),Коэффициенты!F63,IF(AM63=J63,\"[/b]\",\"\"),\" - \",IF(AN63=J63,\"[b]\",\"\"),Коэффициенты!G63,IF(AN63=J63,\"[/b]\",\"\"),\" )\",IF(J63=\"\",$M$13,\"\"))),\"\"),\"\")","v":"[color=#00BF00]M. Kukushkin..... vs F. Dancevic(WC)..... ( 8 - 12 )[/color]"},null,null,null,null,null,null,null,null,null,null,{"$f":"IF(Коэффициенты!L63<>\"\",Коэффициенты!L63,\"\")","v":53},{"$f":"IF(Коэффициенты!M63<>\"\",Коэффициенты!M63,\"\")","v":"M. Baghdatis"},null,null,null,null,null,null,null,null,null,null,null,null,null,null,null,null,null,null,null,null,null,{"$f":"IF(Коэффициенты!D63<>\"\",Коэффициенты!D63,\"\")","v":"M. Kukushkin"},{"$f":"IF(Коэффициенты!E63<>\"\",Коэффициенты!E63,\"\")","v":"F. Dancevic"},"…"]
[null,{"$f":"IF(Коэффициенты!B64<>\"\",Коэффициенты!B64,\"\")","v":""},"",{"$f":"IF(Коэффициенты!C64<>\"\",Коэффициенты!C64,\"\")","v":23},{"$f":"IF(AND(AM64<>\"\",AN64<>\"\"),IF(OR(AM64<>\"\",AN64<>\"\"),IF(AN64=\"bye\",CONCATENATE($M$16,AM64,IF(AND(AM64<>\"\",AM64<>\"(Q)\"),VLOOKUP(AM64,$Q$11:$R$200,2,0),\"\"),\"..... vs \",AN64,$M$17),CONCATENATE(IF(J64=\"\",$M$12,\"\"),IF(AM64=J64,\"[b]\",\"\"),AM64,IF(AND(AM64<>\"\",AM64<>\"(Q)\"),VLOOKUP(AM64,$Q$11:$R$200,2,0),\"\"),IF(AM64=J64,\"[/b]\",\"\"),\"..... vs \",IF(AN64=J64,\"[b]\",\"\"),AN64,IF(AND(AN64<>\"\",AN64<>\"(Q)\"),VLOOKUP(AN64,$Q$11:$R$200,2,0),\"\"),IF(AN64=J64,\"[/b]\",\"\"),\"..... ( \",IF(AM64=J64,\"[b]\",\"\"),Коэффициенты!F64,IF(AM64=J64,\"[/b]\",\"\"),\" - \",IF(AN64=J64,\"[b]\",\"\"),Коэффициенты!G64,IF(AN64=J64,\"[/b]\",\"\"),\" )\",IF(J64=\"\",$M$13,\"\"))),\"\"),\"\")","v":"[color=#00BF00]J. Benneteau..... vs W. Odesnik(Q)..... ( 6 - 14 )[/color]"},null,null,null,null,null,null,null,null,null,null,{"$f":"IF(Коэффициенты!L64<>\"\",Коэффициенты!L64,\"\")","v":54},{"$f":"IF(Коэффициенты!M64<>\"\",Коэффициенты!M64,\"\")","v":"A. Ramos"},null,null,null,null,null,null,null,null,null,null,null,null,null,null,null,null,null,null,null,null,null,{"$f":"IF(Коэффициенты!D64<>\"\",Коэффициенты!D64,\"\")","v":"J. Benneteau"},{"$f":"IF(Коэффициенты!E64<>\"\",Коэффициенты!E64,\"\")","v":"W. Odesnik"},"…"]
[null,{"$f":"IF(Коэффициенты!B65<>\"\",Коэффициенты!B65,\"\")","v":""},"",{"$f":"IF(Коэффициенты!C65<>\"\",Коэффициенты!C65,\"\")","v":24},{"$f":"IF(AND(AM65<>\"\",AN65<>\"\"),IF(OR(AM65<>\"\",AN65<>\"\"),IF(AN65=\"bye\",CONCATENATE($M$16,AM65,IF(AND(AM65<>\"\",AM65<>\"(Q)\"),VLOOKUP(AM65,$Q$11:$R$200,2,0),\"\"),\"..... vs \",AN65,$M$17),CONCATENATE(IF(J65=\"\",$M$12,\"\"),IF(AM65=J65,\"[b]\",\"\"),AM65,IF(AND(AM65<>\"\",AM65<>\"(Q)\"),VLOOKUP(AM65,$Q$11:$R$200,2,0),\"\"),IF(AM65=J65,\"[/b]\",\"\"),\"..... vs \",IF(AN65=J65,\"[b]\",\"\"),AN65,IF(AND(AN65<>\"\",AN65<>\"(Q)\"),VLOOKUP(AN65,$Q$11:$R$200,2,0),\"\"),IF(AN65=J65,\"[/b]\",\"\"),\"..... ( \",IF(AM65=J65,\"[b]\",\"\"),Коэффициенты!F65,IF(AM65=J65,\"[/b]\",\"\"),\" - \",IF(AN65=J65,\"[b]\",\"\"),Коэффициенты!G65,IF(AN65=J65,\"[/b]\",\"\"),\" )\",IF(J65=\"\",$M$13,\"\"))),\"\"),\"\")","v":"[color=#BF4040]T. Berdych(4)..... vs bye[/color]"},null,null,null,null,null,null,null,null,null,null,{"$f":"IF(Коэффициенты!L65<>\"\",Коэффициенты!L65,\"\")","v":55},{"$f":"IF(Коэффициенты!M65<>\"\",Коэффициенты!M65,\"\")","v":"A. Bogomolov Jr."},null,null,null,null,null,null,null,null,null,null,null,null,null,null,null,null,null,null,null,null,null,{"$f":"IF(Коэффициенты!D65<>\"\",Коэффициенты!D65,\"\")","v":"T. Berdych"},{"$f":"IF(Коэффициенты!E65<>\"\",Коэффициенты!E65,\"\")","v":"bye"},"…"]
[null,{"$f":"IF(Коэффициенты!B66<>\"\",Коэффициенты!B66,\"\")","v":""},"",{"$f":"IF(Коэффициенты!C66<>\"\",Коэффициенты!C66,\"\")","v":25},{"$f":"IF(AND(AM66<>\"\",AN66<>\"\"),IF(OR(AM66<>\"\",AN66<>\"\"),IF(AN66=\"bye\",CONCATENATE($M$16,AM66,IF(AND(AM66<>\"\",AM66<>\"(Q)\"),VLOOKUP(AM66,$Q$11:$R$200,2,0),\"\"),\"..... vs \",AN66,$M$17),CONCATENATE(IF(J66=\"\",$M$12,\"\"),IF(AM66=J66,\"[b]\",\"\"),AM66,IF(AND(AM66<>\"\",AM66<>\"(Q)\"),VLOOKUP(AM66,$Q$11:$R$200,2,0),\"\"),IF(AM66=J66,\"[/b]\",\"\"),\"..... vs \",IF(AN66=J66,\"[b]\",\"\"),AN66,IF(AND(AN66<>\"\",AN66<>\"(Q)\"),VLOOKUP(AN66,$Q$11:$R$200,2,0),\"\"),IF(AN66=J66,\"[/b]\",\"\"),\"..... ( \",IF(AM66=J66,\"[b]\",\"\"),Коэффициенты!F66,IF(AM66=J66,\"[/b]\",\"\"),\" - \",IF(AN66=J66,\"[b]\",\"\"),Коэффициенты!G66,IF(AN66=J66,\"[/b]\",\"\"),\" )\",IF(J66=\"\",$M$13,\"\"))),\"\"),\"\")","v":"[color=#BF4040]J. Isner(8)..... vs bye[/color]"},null,null,null,null,null,null,null,null,null,null,{"$f":"IF(Коэффициенты!L66<>\"\",Коэффициенты!L66,\"\")","v":56},{"$f":"IF(Коэффициенты!M66<>\"\",Коэффициенты!M66,\"\")","v":"D. Young"},null,null,null,null,null,null,null,null,null,null,null,null,null,null,null,null,null,null,null,null,null,{"$f":"IF(Коэффициенты!D66<>\"\",Коэффициенты!D66,\"\")","v":"J. Isner"},{"$f":"IF(Коэффициенты!E66<>\"\",Коэффициенты!E66,\"\")","v":"bye"},"…"]
[null,{"$f":"IF(Коэффициенты!B67<>\"\",Коэффициенты!B67,\"\")","v":""},"",{"$f":"IF(Коэффициенты!C67<>\"\",Коэффициенты!C67,\"\")","v":26},{"$f":"IF(AND(AM67<>\"\",AN67<>\"\"),IF(OR(AM67<>\"\",AN67<>\"\"),IF(AN67=\"bye\",CONCATENATE($M$16,AM67,IF(AND(AM67<>\"\",AM67<>\"(Q)\"),VLOOKUP(AM67,$Q$11:$R$200,2,0),\"\"),\"..... vs \",AN67,$M$17),CONCATENATE(IF(J67=\"\",$M$12,\"\"),IF(AM67=J67,\"[b]\",\"\"),AM67,IF(AND(AM67<>\"\",AM67<>\"(Q)\"),VLOOKUP(AM67,$Q$11:$R$200,2,0),\"\"),IF(AM67=J67,\"[/b]\",\"\"),\"..... vs \",IF(AN67=J67,\"[b]\",\"\"),AN67,IF(AND(AN67<>\"\",AN67<>\"(Q)\"),VLOOKUP(AN67,$Q$11:$R$200,2,0),\"\"),IF(AN67=J67,\"[/b]\",\"\"),\"..... ( \",IF(AM67=J67,\"[b]\",\"\"),Коэффициенты!F67,IF(AM67=J67,\"[/b]\",\"\"),\" - \",IF(AN67=J67,\"[b]\",\"\"),Коэффициенты!G67,IF(AN67=J67,\"[/b]\",\"\"),\" )\",IF(J67=\"\",$M$13,\"\"))),\"\"),\"\")","v":"[color=#00BF00]P. Andujar..... vs L. Lacko..... ( 9 - 11 )[/color]"},null,null,null,null,null,null,null,null,null,null,{"$f":"IF(Коэффициенты!L67<>\"\",Коэффициенты!L67,\"\")","v":57},{"$f":"IF(Коэффициенты!M67<>\"\",Коэффициенты!M67,\"\")","v":"R. Harrison"},null,null,null,null,null,null,null,null,null,null,null,null,null,null,null,null,null,null,null,null,null,{"$f":"IF(Коэффициенты!D67<>\"\",Коэффициенты!D67,\"\")","v":"P. Andujar"},{"$f":"IF(Коэффициенты!E67<>\"\",Коэффициенты!E67,\"\")","v":"L. Lacko"},"…"]
[null,{"$f":"IF(Коэффициенты!B68<>\"\",Коэффициенты!B68,\"\")","v":""},"",{"$f":"IF(Коэффициенты!C68<>\"\",Коэффициенты!C68,\"\")","v":27},{"$f":"IF(AND(AM68<>\"\",AN68<>\"\"),IF(OR(AM68<>\"\",AN68<>\"\"),IF(AN68=\"bye\",CONCATENATE($M$16,AM68,IF(AND(AM68<>\"\",AM68<>\"(Q)\"),VLOOKUP(AM68,$Q$11:$R$200,2,0),\"\"),\"..... vs \",AN68,$M$17),CONCATENATE(IF(J68=\"\",$M$12,\"\"),IF(AM68=J68,\"[b]\",\"\"),AM68,IF(AND(AM68<>\"\",AM68<>\"(Q)\"),VLOOKUP(AM68,$Q$11:$R$200,2,0),\"\"),IF(AM68=J68,\"[/b]\",\"\"),\"..... vs \",IF(AN68=J68,\"[b]\",\"\"),AN68,IF(AND(AN68<>\"\",AN68<>\"(Q)\"),VLOOKUP(AN68,$Q$11:$R$200,2,0),\"\"),IF(AN68=J68,\"[/b]\",\"\"),\"..... ( \",IF(AM68=J68,\"[b]\",\"\"),Коэффициенты!F68,IF(AM68=J68,\"[/b]\",\"\"),\" - \",IF(AN68=J68,\"[b]\",\"\"),Коэффициенты!G68,IF(AN68=J68,\"[/b]\",\"\"),\" )\",IF(J68=\"\",$M$13,\"\"))),\"\"),\"\")","v":"[color=#00BF00]Y.-H. Lu..... vs F. Fognini(Q)..... ( 10 - 10 )[/color]"},null,null,null,null,null,null,null,null,null,null,{"$f":"IF(Коэффициенты!L68<>\"\",Коэффициенты!L68,\"\")","v":58},{"$f":"IF(Коэффициенты!M68<>\"\",Коэффициенты!M68,\"\")","v":"M. Kukushkin"},null,null,null,null,null,null,null,null,null,null,null,null,null,null,null,null,null,null,null,null,null,{"$f":"IF(Коэффициенты!D68<>\"\",Коэффициенты!D68,\"\")","v":"Y.-H. Lu"},{"$f":"IF(Коэффициенты!E68<>\"\",Коэффициенты!E68,\"\")","v":"F. Fognini"},"…"]
[null,{"$f":"IF(Коэффициенты!B69<>\"\",Коэффициенты!B69,\"\")","v":""},"",{"$f":"IF(Коэффициенты!C69<>\"\",Коэффициенты!C69,\"\")","v":28},{"$f":"IF(AND(AM69<>\"\",AN69<>\"\"),IF(OR(AM69<>\"\",AN69<>\"\"),IF(AN69=\"bye\",CONCATENATE($M$16,AM69,IF(AND(AM69<>\"\",AM69<>\"(Q)\"),VLOOKUP(AM69,$Q$11:$R$200,2,0),\"\"),\"..... vs \",AN69,$M$17),CONCATENATE(IF(J69=\"\",$M$12,\"\"),IF(AM69=J69,\"[b]\",\"\"),AM69,IF(AND(AM69<>\"\",AM69<>\"(Q)\"),VLOOKUP(AM69,$Q$11:$R$200,2,0),\"\"),IF(AM69=J69,\"[/b]\",\"\"),\"..... vs \",IF(AN69=J69,\"[b]\",\"\"),AN69,IF(AND(AN69<>\"\",AN69<>\"(Q)\"),VLOOKUP(AN69,$Q$11:$R$200,2,0),\"\"),IF(AN69=J69,\"[/b]\",\"\"),\"..... ( \",IF(AM69=J69,\"[b]\",\"\"),Коэффициенты!F69,IF(AM69=J69,\"[/b]\",\"\"),\" - \",IF(AN69=J69,\"[b]\",\"\"),Коэффициенты!G69,IF(AN69=J69,\"[/b]\",\"\"),\" )\",IF(J69=\"\",$M$13,\"\"))),\"\"),\"\")","v":"[color=#BF4040]P. Kohlschreiber(12)..... vs bye[/color]"},null,null,null,null,null,null,null,null,null,null,{"$f":"IF(Коэффициенты!L69<>\"\",Коэффициенты!L69,\"\")","v":59},{"$f":"IF(Коэффициенты!M69<>\"\",Коэффициенты!M69,\"\")","v":"L. Kubot"},null,null,null,null,null,null,null,null,null,null,null,null,null,null,null,null,null,null,null,null,null,{"$f":"IF(Коэффициенты!D69<>\"\",Коэффициенты!D69,\"\")","v":"P. Kohlschreiber"},{"$f":"IF(Коэффициенты!E69<>\"\",Коэффициенты!E69,\"\")","v":"bye"},"…"]
[null,{"$f":"IF(Коэффициенты!B70<>\"\",Коэффициенты!B70,\"\")","v":""},"",{"$f":"IF(Коэффициенты!C70<>\"\",Коэффициенты!C70,\"\")","v":29},{"$f":"IF(AND(AM70<>\"\",AN70<>\"\"),IF(OR(AM70<>\"\",AN70<>\"\"),IF(AN70=\"bye\",CONCATENATE($M$16,AM70,IF(AND(AM70<>\"\",AM70<>\"(Q)\"),VLOOKUP(AM70,$Q$11:$R$200,2,0),\"\"),\"..... vs \",AN70,$M$17),CONCATENATE(IF(J70=\"\",$M$12,\"\"),IF(AM70=J70,\"[b]\",\"\"),AM70,IF(AND(AM70<>\"\",AM70<>\"(Q)\"),VLOOKUP(AM70,$Q$11:$R$200,2,0),\"\"),IF(AM70=J70,\"[/b]\",\"\"),\"..... vs \",IF(AN70=J70,\"[b]\",\"\"),AN70,IF(AND(AN70<>\"\",AN70<>\"(Q)\"),VLOOKUP(AN70,$Q$11:$R$200,2,0),\"\"),IF(AN70=J70,\"[/b]\",\"\"),\"..... ( \",IF(AM70=J70,\"[b]\",\"\"),Коэффициенты!F70,IF(AM70=J70,\"[/b]\",\"\"),\" - \",IF(AN70=J70,\"[b]\",\"\"),Коэффициенты!G70,IF(AN70=J70,\"[/b]\",\"\"),\" )\",IF(J70=\"\",$M$13,\"\"))),\"\"),\"\")","v":"[color=#BF4040]M. Raonic(16)..... vs bye[/color]"},null,null,null,null,null,null,null,null,null,null,{"$f":"IF(Коэффициенты!L70<>\"\",Коэффициенты!L70,\"\")","v":60},{"$f":"IF(Коэффициенты!M70<>\"\",Коэффициенты!M70,\"\")","v":"J. Zopp"},"(Q)",null,null,null,null,null,null,null,null,null,null,null,null,null,null,null,null,null,null,null,null,{"$f":"IF(Коэффициенты!D70<>\"\",Коэффициенты!D70,\"\")","v":"M. Raonic"},{"$f":"IF(Коэффициенты!E70<>\"\",Коэффициенты!E70,\"\")","v":"bye"},"…"]
[null,{"$f":"IF(Коэффициенты!B71<>\"\",Коэффициенты!B71,\"\")","v":""},"",{"$f":"IF(Коэффициенты!C71<>\"\",Коэффициенты!C71,\"\")","v":30},{"$f":"IF(AND(AM71<>\"\",AN71<>\"\"),IF(OR(AM71<>\"\",AN71<>\"\"),IF(AN71=\"bye\",CONCATENATE($M$16,AM71,IF(AND(AM71<>\"\",AM71<>\"(Q)\"),VLOOKUP(AM71,$Q$11:$R$200,2,0),\"\"),\"..... vs \",AN71,$M$17),CONCATENATE(IF(J71=\"\",$M$12,\"\"),IF(AM71=J71,\"[b]\",\"\"),AM71,IF(AND(AM71<>\"\",AM71<>\"(Q)\"),VLOOKUP(AM71,$Q$11:$R$200,2,0),\"\"),IF(AM71=J71,\"[/b]\",\"\"),\"..... vs \",IF(AN71=J71,\"[b]\",\"\"),AN71,IF(AND(AN71<>\"\",AN71<>\"(Q)\"),VLOOKUP(AN71,$Q$11:$R$200,2,0),\"\"),IF(AN71=J71,\"[/b]\",\"\"),\"..... ( \",IF(AM71=J71,\"[b]\",\"\"),Коэффициенты!F71,IF(AM71=J71,\"[/b]\",\"\"),\" - \",IF(AN71=J71,\"[b]\",\"\"),Коэффициенты!G71,IF(AN71=J71,\"[/b]\",\"\"),\" )\",IF(J71=\"\",$M$13,\"\"))),\"\"),\"\")","v":"[color=#00BF00]A. Bogomolov Jr...... vs V. Troicki..... ( 11,5 - 8,5 )[/color]"},null,null,null,null,null,null,null,null,null,null,{"$f":"IF(Коэффициенты!L71<>\"\",Коэффициенты!L71,\"\")","v":61},{"$f":"IF(Коэффициенты!M71<>\"\",Коэффициенты!M71,\"\")","v":""},null,null,null,null,null,null,null,null,null,null,null,null,null,null,null,null,null,null,null,null,null,{"$f":"IF(Коэффициенты!D71<>\"\",Коэффициенты!D71,\"\")","v":"A. Bogomolov Jr."},{"$f":"IF(Коэффициенты!E71<>\"\",Коэффициенты!E71,\"\")","v":"V. Troicki"},"…"]
[null,{"$f":"IF(Коэффициенты!B72<>\"\",Коэффициенты!B72,\"\")","v":""},"",{"$f":"IF(Коэффициенты!C72<>\"\",Коэффициенты!C72,\"\")","v":31},{"$f":"IF(AND(AM72<>\"\",AN72<>\"\"),IF(OR(AM72<>\"\",AN72<>\"\"),IF(AN72=\"bye\",CONCATENATE($M$16,AM72,IF(AND(AM72<>\"\",AM72<>\"(Q)\"),VLOOKUP(AM72,$Q$11:$R$200,2,0),\"\"),\"..... vs \",AN72,$M$17),CONCATENATE(IF(J72=\"\",$M$12,\"\"),IF(AM72=J72,\"[b]\",\"\"),AM72,IF(AND(AM72<>\"\",AM72<>\"(Q)\"),VLOOKUP(AM72,$Q$11:$R$200,2,0),\"\"),IF(AM72=J72,\"[/b]\",\"\"),\"..... vs \",IF(AN72=J72,\"[b]\",\"\"),AN72,IF(AND(AN72<>\"\",AN72<>\"(Q)\"),VLOOKUP(AN72,$Q$11:$R$200,2,0),\"\"),IF(AN72=J72,\"[/b]\",\"\"),\"..... ( \",IF(AM72=J72,\"[b]\",\"\"),Коэффициенты!F72,IF(AM72=J72,\"[/b]\",\"\"),\" - \",IF(AN72=J72,\"[b]\",\"\"),Коэффициенты!G72,IF(AN72=J72,\"[/b]\",\"\"),\" )\",IF(J72=\"\",$M$13,\"\"))),\"\"),\"\")","v":"[color=#00BF00]F. Cipolla(Q)..... vs J. Zopp(Q)..... ( 10,5 - 9,5 )[/color]"},null,null,null,null,null,null,null,null,null,null,{"$f":"IF(Коэффициенты!L72<>\"\",Коэффициенты!L72,\"\")","v":62},{"$f":"IF(Коэффициенты!M72<>\"\",Коэффициенты!M72,\"\")","v":""},null,null,null,null,null,null,null,null,null,null,null,null,null,null,null,null,null,null,null,null,null,{"$f":"IF(Коэффициенты!D72<>\"\",Коэффициенты!D72,\"\")","v":"F. Cipolla"},{"$f":"IF(Коэффициенты!E72<>\"\",Коэффициенты!E72,\"\")","v":"J. Zopp"},"…"]
[null,{"$f":"IF(Коэффициенты!B73<>\"\",Коэффициенты!B73,\"\")","v":""},"",{"$f":"IF(Коэффициенты!C73<>\"\",Коэффициенты!C73,\"\")","v":32},{"$f":"IF(AND(AM73<>\"\",AN73<>\"\"),IF(OR(AM73<>\"\",AN73<>\"\"),IF(AN73=\"bye\",CONCATENATE($M$16,AM73,IF(AND(AM73<>\"\",AM73<>\"(Q)\"),VLOOKUP(AM73,$Q$11:$R$200,2,0),\"\"),\"..... vs \",AN73,$M$17),CONCATENATE(IF(J73=\"\",$M$12,\"\"),IF(AM73=J73,\"[b]\",\"\"),AM73,IF(AND(AM73<>\"\",AM73<>\"(Q)\"),VLOOKUP(AM73,$Q$11:$R$200,2,0),\"\"),IF(AM73=J73,\"[/b]\",\"\"),\"..... vs \",IF(AN73=J73,\"[b]\",\"\"),AN73,IF(AND(AN73<>\"\",AN73<>\"(Q)\"),VLOOKUP(AN73,$Q$11:$R$200,2,0),\"\"),IF(AN73=J73,\"[/b]\",\"\"),\"..... ( \",IF(AM73=J73,\"[b]\",\"\"),Коэффициенты!F73,IF(AM73=J73,\"[/b]\",\"\"),\" - \",IF(AN73=J73,\"[b]\",\"\"),Коэффициенты!G73,IF(AN73=J73,\"[/b]\",\"\"),\" )\",IF(J73=\"\",$M$13,\"\"))),\"\"),\"\")","v":"[color=#BF4040]A. Murray(2)..... vs bye[/color]"},null,null,null,null,null,null,null,null,null,null,{"$f":"IF(Коэффициенты!L73<>\"\",Коэффициенты!L73,\"\")","v":63},{"$f":"IF(Коэффициенты!M73<>\"\",Коэффициенты!M73,\"\")","v":""},null,null,null,null,null,null,null,null,null,null,null,null,null,null,null,null,null,null,null,null,null,{"$f":"IF(Коэффициенты!D73<>\"\",Коэффициенты!D73,\"\")","v":"A. Murray"},{"$f":"IF(Коэффициенты!E73<>\"\",Коэффициенты!E73,\"\")","v":"bye"},"…"]
[null,{"$f":"IF(Коэффициенты!B74<>\"\",Коэффициенты!B74,\"\")","v":""},"",{"$f":"IF(Коэффициенты!C74<>\"\",Коэффициенты!C74,\"\")","v":""},{"$f":"IF(AND(AM74<>\"\",AN74<>\"\"),IF(OR(AM74<>\"\",AN74<>\"\"),IF(AN74=\"bye\",CONCATENATE($M$16,AM74,IF(AND(AM74<>\"\",AM74<>\"(Q)\"),VLOOKUP(AM74,$Q$11:$R$200,2,0),\"\"),\"..... vs \",AN74,$M$17),CONCATENATE(IF(J74=\"\",$M$12,\"\"),IF(AM74=J74,\"[b]\",\"\"),AM74,IF(AND(AM74<>\"\",AM74<>\"(Q)\"),VLOOKUP(AM74,$Q$11:$R$200,2,0),\"\"),IF(AM74=J74,\"[/b]\",\"\"),\"..... vs \",IF(AN74=J74,\"[b]\",\"\"),AN74,IF(AND(AN74<>\"\",AN74<>\"(Q)\"),VLOOKUP(AN74,$Q$11:$R$200,2,0),\"\"),IF(AN74=J74,\"[/b]\",\"\"),\"..... ( \",IF(AM74=J74,\"[b]\",\"\"),Коэффициенты!F74,IF(AM74=J74,\"[/b]\",\"\"),\" - \",IF(AN74=J74,\"[b]\",\"\"),Коэффициенты!G74,IF(AN74=J74,\"[/b]\",\"\"),\" )\",IF(J74=\"\",$M$13,\"\"))),\"\"),\"\")","v":""},null,null,null,null,null,null,null,null,null,null,{"$f":"IF(Коэффициенты!L74<>\"\",Коэффициенты!L74,\"\")","v":64},{"$f":"IF(Коэффициенты!M74<>\"\",Коэффициенты!M74,\"\")","v":""},null,null,null,null,null,null,null,null,null,null,null,null,null,null,null,null,null,null,null,null,null,{"$f":"IF(Коэффициенты!D74<>\"\",Коэффициенты!D74,\"\")","v":""},{"$f":"IF(Коэффициенты!E74<>\"\",Коэффициенты!E74,\"\")","v":""},""]
[null,{"$f":"IF(Коэффициенты!B75<>\"\",Коэффициенты!B75,\"\")","v":""},{"$f":"IF(B75<>\"\",CONCATENATE($M$20,B75,$M$21),\"\")","v":""},{"$f":"IF(Коэффициенты!C75<>\"\",Коэффициенты!C75,\"\")","v":""},{"$f":"IF(AND(AM75<>\"\",AN75<>\"\"),IF(OR(AM75<>\"\",AN75<>\"\"),IF(AN75=\"bye\",CONCATENATE($M$16,AM75,IF(AND(AM75<>\"\",AM75<>\"(Q)\"),VLOOKUP(AM75,$Q$11:$R$200,2,0),\"\"),\"..... vs \",AN75,$M$17),CONCATENATE(IF(J75=\"\",$M$12,\"\"),IF(AM75=J75,\"[b]\",\"\"),AM75,IF(AND(AM75<>\"\",AM75<>\"(Q)\"),VLOOKUP(AM75,$Q$11:$R$200,2,0),\"\"),IF(AM75=J75,\"[/b]\",\"\"),\"..... vs \",IF(AN75=J75,\"[b]\",\"\"),AN75,IF(AND(AN75<>\"\",AN75<>\"(Q)\"),VLOOKUP(AN75,$Q$11:$R$200,2,0),\"\"),IF(AN75=J75,\"[/b]\",\"\"),\"..... ( \",IF(AM75=J75,\"[b]\",\"\"),Коэффициенты!F75,IF(AM75=J75,\"[/b]\",\"\"),\" - \",IF(AN75=J75,\"[b]\",\"\"),Коэффициенты!G75,IF(AN75=J75,\"[/b]\",\"\"),\" )\",IF(J75=\"\",$M$13,\"\"))),\"\"),\"\")","v":""},null,null,null,null,null,null,null,null,null,null,{"$f":"IF(Коэффициенты!L75<>\"\",Коэффициенты!L75,\"\")","v":65},{"$f":"IF(Коэффициенты!M75<>\"\",Коэффициенты!M75,\"\")","v":""},null,null,null,null,null,null,null,null,null,null,null,null,null,null,null,null,null,null,null,null,null,{"$f":"IF(Коэффициенты!D75<>\"\",Коэффициенты!D75,\"\")","v":""},{"$f":"IF(Коэффициенты!E75<>\"\",Коэффициенты!E75,\"\")","v":""},""]
[null,{"$f":"IF(Коэффициенты!B76<>\"\",Коэффициенты!B76,\"\")","v":""},"",{"$f":"IF(Коэффициенты!C76<>\"\",Коэффициенты!C76,\"\")","v":""},{"$f":"IF(AND(AM76<>\"\",AN76<>\"\"),IF(OR(AM76<>\"\",AN76<>\"\"),IF(AN76=\"bye\",CONCATENATE($M$16,AM76,IF(AND(AM76<>\"\",AM76<>\"(Q)\"),VLOOKUP(AM76,$Q$11:$R$200,2,0),\"\"),\"..... vs \",AN76,$M$17),CONCATENATE(IF(J76=\"\",$M$12,\"\"),IF(AM76=J76,\"[b]\",\"\"),AM76,IF(AND(AM76<>\"\",AM76<>\"(Q)\"),VLOOKUP(AM76,$Q$11:$R$200,2,0),\"\"),IF(AM76=J76,\"[/b]\",\"\"),\"..... vs \",IF(AN76=J76,\"[b]\",\"\"),AN76,IF(AND(AN76<>\"\",AN76<>\"(Q)\"),VLOOKUP(AN76,$Q$11:$R$200,2,0),\"\"),IF(AN76=J76,\"[/b]\",\"\"),\"..... ( \",IF(AM76=J76,\"[b]\",\"\"),Коэффициенты!F76,IF(AM76=J76,\"[/b]\",\"\"),\" - \",IF(AN76=J76,\"[b]\",\"\"),Коэффициенты!G76,IF(AN76=J76,\"[/b]\",\"\"),\" )\",IF(J76=\"\",$M$13,\"\"))),\"\"),\"\")","v":""},null,null,null,null,null,null,null,null,null,null,{"$f":"IF(Коэффициенты!L76<>\"\",Коэффициенты!L76,\"\")","v":66},{"$f":"IF(Коэффициенты!M76<>\"\",Коэффициенты!M76,\"\")","v":""},null,null,null,null,null,null,null,null,null,null,null,null,null,null,null,null,null,null,null,null,null,{"$f":"IF(Коэффициенты!D76<>\"\",Коэффициенты!D76,\"\")","v":""},{"$f":"IF(Коэффициенты!E76<>\"\",Коэффициенты!E76,\"\")","v":""},""]
[null,{"$f":"IF(Коэффициенты!B77<>\"\",Коэффициенты!B77,\"\")","v":""},"",{"$f":"IF(Коэффициенты!C77<>\"\",Коэффициенты!C77,\"\")","v":""},{"$f":"IF(AND(AM77<>\"\",AN77<>\"\"),IF(OR(AM77<>\"\",AN77<>\"\"),IF(AN77=\"bye\",CONCATENATE($M$16,AM77,IF(AND(AM77<>\"\",AM77<>\"(Q)\"),VLOOKUP(AM77,$Q$11:$R$200,2,0),\"\"),\"..... vs \",AN77,$M$17),CONCATENATE(IF(J77=\"\",$M$12,\"\"),IF(AM77=J77,\"[b]\",\"\"),AM77,IF(AND(AM77<>\"\",AM77<>\"(Q)\"),VLOOKUP(AM77,$Q$11:$R$200,2,0),\"\"),IF(AM77=J77,\"[/b]\",\"\"),\"..... vs \",IF(AN77=J77,\"[b]\",\"\"),AN77,IF(AND(AN77<>\"\",AN77<>\"(Q)\"),VLOOKUP(AN77,$Q$11:$R$200,2,0),\"\"),IF(AN77=J77,\"[/b]\",\"\"),\"..... ( \",IF(AM77=J77,\"[b]\",\"\"),Коэффициенты!F77,IF(AM77=J77,\"[/b]\",\"\"),\" - \",IF(AN77=J77,\"[b]\",\"\"),Коэффициенты!G77,IF(AN77=J77,\"[/b]\",\"\"),\" )\",IF(J77=\"\",$M$13,\"\"))),\"\"),\"\")","v":""},null,null,null,null,null,null,null,null,null,null,{"$f":"IF(Коэффициенты!L77<>\"\",Коэффициенты!L77,\"\")","v":67},{"$f":"IF(Коэффициенты!M77<>\"\",Коэффициенты!M77,\"\")","v":""},null,null,null,null,null,null,null,null,null,null,null,null,null,null,null,null,null,null,null,null,null,{"$f":"IF(Коэффициенты!D77<>\"\",Коэффициенты!D77,\"\")","v":""},{"$f":"IF(Коэффициенты!E77<>\"\",Коэффициенты!E77,\"\")","v":""},""]
[null,{"$f":"IF(Коэффициенты!B78<>\"\",Коэффициенты!B78,\"\")","v":""},"",{"$f":"IF(Коэффициенты!C78<>\"\",Коэффициенты!C78,\"\")","v":""},{"$f":"IF(AND(AM78<>\"\",AN78<>\"\"),IF(OR(AM78<>\"\",AN78<>\"\"),IF(AN78=\"bye\",CONCATENATE($M$16,AM78,IF(AND(AM78<>\"\",AM78<>\"(Q)\"),VLOOKUP(AM78,$Q$11:$R$200,2,0),\"\"),\"..... vs \",AN78,$M$17),CONCATENATE(IF(J78=\"\",$M$12,\"\"),IF(AM78=J78,\"[b]\",\"\"),AM78,IF(AND(AM78<>\"\",AM78<>\"(Q)\"),VLOOKUP(AM78,$Q$11:$R$200,2,0),\"\"),IF(AM78=J78,\"[/b]\",\"\"),\"..... vs \",IF(AN78=J78,\"[b]\",\"\"),AN78,IF(AND(AN78<>\"\",AN78<>\"(Q)\"),VLOOKUP(AN78,$Q$11:$R$200,2,0),\"\"),IF(AN78=J78,\"[/b]\",\"\"),\"..... ( \",IF(AM78=J78,\"[b]\",\"\"),Коэффициенты!F78,IF(AM78=J78,\"[/b]\",\"\"),\" - \",IF(AN78=J78,\"[b]\",\"\"),Коэффициенты!G78,IF(AN78=J78,\"[/b]\",\"\"),\" )\",IF(J78=\"\",$M$13,\"\"))),\"\"),\"\")","v":""},null,null,null,null,null,null,null,null,null,null,{"$f":"IF(Коэффициенты!L78<>\"\",Коэффициенты!L78,\"\")","v":68},{"$f":"IF(Коэффициенты!M78<>\"\",Коэффициенты!M78,\"\")","v":""},null,null,null,null,null,null,null,null,null,null,null,null,null,null,null,null,null,null,null,null,null,{"$f":"IF(Коэффициенты!D78<>\"\",Коэффициенты!D78,\"\")","v":""},{"$f":"IF(Коэффициенты!E78<>\"\",Коэффициенты!E78,\"\")","v":""},""]
[null,{"$f":"IF(Коэффициенты!B79<>\"\",Коэффициенты!B79,\"\")","v":""},"",{"$f":"IF(Коэффициенты!C79<>\"\",Коэффициенты!C79,\"\")","v":""},{"$f":"IF(AND(AM79<>\"\",AN79<>\"\"),IF(OR(AM79<>\"\",AN79<>\"\"),IF(AN79=\"bye\",CONCATENATE($M$16,AM79,IF(AND(AM79<>\"\",AM79<>\"(Q)\"),VLOOKUP(AM79,$Q$11:$R$200,2,0),\"\"),\"..... vs \",AN79,$M$17),CONCATENATE(IF(J79=\"\",$M$12,\"\"),IF(AM79=J79,\"[b]\",\"\"),AM79,IF(AND(AM79<>\"\",AM79<>\"(Q)\"),VLOOKUP(AM79,$Q$11:$R$200,2,0),\"\"),IF(AM79=J79,\"[/b]\",\"\"),\"..... vs \",IF(AN79=J79,\"[b]\",\"\"),AN79,IF(AND(AN79<>\"\",AN79<>\"(Q)\"),VLOOKUP(AN79,$Q$11:$R$200,2,0),\"\"),IF(AN79=J79,\"[/b]\",\"\"),\"..... ( \",IF(AM79=J79,\"[b]\",\"\"),Коэффициенты!F79,IF(AM79=J79,\"[/b]\",\"\"),\" - \",IF(AN79=J79,\"[b]\",\"\"),Коэффициенты!G79,IF(AN79=J79,\"[/b]\",\"\"),\" )\",IF(J79=\"\",$M$13,\"\"))),\"\"),\"\")","v":""},null,null,null,null,null,null,null,null,null,null,{"$f":"IF(Коэффициенты!L79<>\"\",Коэффициенты!L79,\"\")","v":69},{"$f":"IF(Коэффициенты!M79<>\"\",Коэффициенты!M79,\"\")","v":""},null,null,null,null,null,null,null,null,null,null,null,null,null,null,null,null,null,null,null,null,null,{"$f":"IF(Коэффициенты!D79<>\"\",Коэффициенты!D79,\"\")","v":""},{"$f":"IF(Коэффициенты!E79<>\"\",Коэффициенты!E79,\"\")","v":""},""]
[null,{"$f":"IF(Коэффициенты!B80<>\"\",Коэффициенты!B80,\"\")","v":""},"",{"$f":"IF(Коэффициенты!C80<>\"\",Коэффициенты!C80,\"\")","v":""},{"$f":"IF(AND(AM80<>\"\",AN80<>\"\"),IF(OR(AM80<>\"\",AN80<>\"\"),IF(AN80=\"bye\",CONCATENATE($M$16,AM80,IF(AND(AM80<>\"\",AM80<>\"(Q)\"),VLOOKUP(AM80,$Q$11:$R$200,2,0),\"\"),\"..... vs \",AN80,$M$17),CONCATENATE(IF(J80=\"\",$M$12,\"\"),IF(AM80=J80,\"[b]\",\"\"),AM80,IF(AND(AM80<>\"\",AM80<>\"(Q)\"),VLOOKUP(AM80,$Q$11:$R$200,2,0),\"\"),IF(AM80=J80,\"[/b]\",\"\"),\"..... vs \",IF(AN80=J80,\"[b]\",\"\"),AN80,IF(AND(AN80<>\"\",AN80<>\"(Q)\"),VLOOKUP(AN80,$Q$11:$R$200,2,0),\"\"),IF(AN80=J80,\"[/b]\",\"\"),\"..... ( \",IF(AM80=J80,\"[b]\",\"\"),Коэффициенты!F80,IF(AM80=J80,\"[/b]\",\"\"),\" - \",IF(AN80=J80,\"[b]\",\"\"),Коэффициенты!G80,IF(AN80=J80,\"[/b]\",\"\"),\" )\",IF(J80=\"\",$M$13,\"\"))),\"\"),\"\")","v":""},null,null,null,null,null,null,null,null,null,null,{"$f":"IF(Коэффициенты!L80<>\"\",Коэффициенты!L80,\"\")","v":70},{"$f":"IF(Коэффициенты!M80<>\"\",Коэффициенты!M80,\"\")","v":""},null,null,null,null,null,null,null,null,null,null,null,null,null,null,null,null,null,null,null,null,null,{"$f":"IF(Коэффициенты!D80<>\"\",Коэффициенты!D80,\"\")","v":""},{"$f":"IF(Коэффициенты!E80<>\"\",Коэффициенты!E80,\"\")","v":""},""]
[null,{"$f":"IF(Коэффициенты!B81<>\"\",Коэффициенты!B81,\"\")","v":""},"",{"$f":"IF(Коэффициенты!C81<>\"\",Коэффициенты!C81,\"\")","v":""},{"$f":"IF(AND(AM81<>\"\",AN81<>\"\"),IF(OR(AM81<>\"\",AN81<>\"\"),IF(AN81=\"bye\",CONCATENATE($M$16,AM81,IF(AND(AM81<>\"\",AM81<>\"(Q)\"),VLOOKUP(AM81,$Q$11:$R$200,2,0),\"\"),\"..... vs \",AN81,$M$17),CONCATENATE(IF(J81=\"\",$M$12,\"\"),IF(AM81=J81,\"[b]\",\"\"),AM81,IF(AND(AM81<>\"\",AM81<>\"(Q)\"),VLOOKUP(AM81,$Q$11:$R$200,2,0),\"\"),IF(AM81=J81,\"[/b]\",\"\"),\"..... vs \",IF(AN81=J81,\"[b]\",\"\"),AN81,IF(AND(AN81<>\"\",AN81<>\"(Q)\"),VLOOKUP(AN81,$Q$11:$R$200,2,0),\"\"),IF(AN81=J81,\"[/b]\",\"\"),\"..... ( \",IF(AM81=J81,\"[b]\",\"\"),Коэффициенты!F81,IF(AM81=J81,\"[/b]\",\"\"),\" - \",IF(AN81=J81,\"[b]\",\"\"),Коэффициенты!G81,IF(AN81=J81,\"[/b]\",\"\"),\" )\",IF(J81=\"\",$M$13,\"\"))),\"\"),\"\")","v":""},null,null,null,null,null,null,null,null,null,null,{"$f":"IF(Коэффициенты!L81<>\"\",Коэффициенты!L81,\"\")","v":71},{"$f":"IF(Коэффициенты!M81<>\"\",Коэффициенты!M81,\"\")","v":""},null,null,null,null,null,null,null,null,null,null,null,null,null,null,null,null,null,null,null,null,null,{"$f":"IF(Коэффициенты!D81<>\"\",Коэффициенты!D81,\"\")","v":""},{"$f":"IF(Коэффициенты!E81<>\"\",Коэффициенты!E81,\"\")","v":""},""]
[null,{"$f":"IF(Коэффициенты!B82<>\"\",Коэффициенты!B82,\"\")","v":""},"",{"$f":"IF(Коэффициенты!C82<>\"\",Коэффициенты!C82,\"\")","v":""},{"$f":"IF(AND(AM82<>\"\",AN82<>\"\"),IF(OR(AM82<>\"\",AN82<>\"\"),IF(AN82=\"bye\",CONCATENATE($M$16,AM82,IF(AND(AM82<>\"\",AM82<>\"(Q)\"),VLOOKUP(AM82,$Q$11:$R$200,2,0),\"\"),\"..... vs \",AN82,$M$17),CONCATENATE(IF(J82=\"\",$M$12,\"\"),IF(AM82=J82,\"[b]\",\"\"),AM82,IF(AND(AM82<>\"\",AM82<>\"(Q)\"),VLOOKUP(AM82,$Q$11:$R$200,2,0),\"\"),IF(AM82=J82,\"[/b]\",\"\"),\"..... vs \",IF(AN82=J82,\"[b]\",\"\"),AN82,IF(AND(AN82<>\"\",AN82<>\"(Q)\"),VLOOKUP(AN82,$Q$11:$R$200,2,0),\"\"),IF(AN82=J82,\"[/b]\",\"\"),\"..... ( \",IF(AM82=J82,\"[b]\",\"\"),Коэффициенты!F82,IF(AM82=J82,\"[/b]\",\"\"),\" - \",IF(AN82=J82,\"[b]\",\"\"),Коэффициенты!G82,IF(AN82=J82,\"[/b]\",\"\"),\" )\",IF(J82=\"\",$M$13,\"\"))),\"\"),\"\")","v":""},null,null,null,null,null,null,null,null,null,null,{"$f":"IF(Коэффициенты!L82<>\"\",Коэффициенты!L82,\"\")","v":72},{"$f":"IF(Коэффициенты!M82<>\"\",Коэффициенты!M82,\"\")","v":""},null,null,null,null,null,null,null,null,null,null,null,null,null,null,null,null,null,null,null,null,null,{"$f":"IF(Коэффициенты!D82<>\"\",Коэффициенты!D82,\"\")","v":""},{"$f":"IF(Коэффициенты!E82<>\"\",Коэффициенты!E82,\"\")","v":""},""]
[null,{"$f":"IF(Коэффициенты!B83<>\"\",Коэффициенты!B83,\"\")","v":""},"",{"$f":"IF(Коэффициенты!C83<>\"\",Коэффициенты!C83,\"\")","v":""},{"$f":"IF(AND(AM83<>\"\",AN83<>\"\"),IF(OR(AM83<>\"\",AN83<>\"\"),IF(AN83=\"bye\",CONCATENATE($M$16,AM83,IF(AND(AM83<>\"\",AM83<>\"(Q)\"),VLOOKUP(AM83,$Q$11:$R$200,2,0),\"\"),\"..... vs \",AN83,$M$17),CONCATENATE(IF(J83=\"\",$M$12,\"\"),IF(AM83=J83,\"[b]\",\"\"),AM83,IF(AND(AM83<>\"\",AM83<>\"(Q)\"),VLOOKUP(AM83,$Q$11:$R$200,2,0),\"\"),IF(AM83=J83,\"[/b]\",\"\"),\"..... vs \",IF(AN83=J83,\"[b]\",\"\"),AN83,IF(AND(AN83<>\"\",AN83<>\"(Q)\"),VLOOKUP(AN83,$Q$11:$R$200,2,0),\"\"),IF(AN83=J83,\"[/b]\",\"\"),\"..... ( \",IF(AM83=J83,\"[b]\",\"\"),Коэффициенты!F83,IF(AM83=J83,\"[/b]\",\"\"),\" - \",IF(AN83=J83,\"[b]\",\"\"),Коэффициенты!G83,IF(AN83=J83,\"[/b]\",\"\"),\" )\",IF(J83=\"\",$M$13,\"\"))),\"\"),\"\")","v":""},null,null,null,null,null,null,null,null,null,null,{"$f":"IF(Коэффициенты!L83<>\"\",Коэффициенты!L83,\"\")","v":73},{"$f":"IF(Коэффициенты!M83<>\"\",Коэффициенты!M83,\"\")","v":""},null,null,null,null,null,null,null,null,null,null,null,null,null,null,null,null,null,null,null,null,null,{"$f":"IF(Коэффициенты!D83<>\"\",Коэффициенты!D83,\"\")","v":""},{"$f":"IF(Коэффициенты!E83<>\"\",Коэффициенты!E83,\"\")","v":""},{"$f":"IF(AND(AM83<>\"\",AN83<>\"\"),\"…\",\"\")","v":""}]
[null,{"$f":"IF(Коэффициенты!B84<>\"\",Коэффициенты!B84,\"\")","v":""},"",{"$f":"IF(Коэффициенты!C84<>\"\",Коэффициенты!C84,\"\")","v":""},{"$f":"IF(AND(AM84<>\"\",AN84<>\"\"),IF(OR(AM84<>\"\",AN84<>\"\"),IF(AN84=\"bye\",CONCATENATE($M$16,AM84,IF(AND(AM84<>\"\",AM84<>\"(Q)\"),VLOOKUP(AM84,$Q$11:$R$200,2,0),\"\"),\"..... vs \",AN84,$M$17),CONCATENATE(IF(J84=\"\",$M$12,\"\"),IF(AM84=J84,\"[b]\",\"\"),AM84,IF(AND(AM84<>\"\",AM84<>\"(Q)\"),VLOOKUP(AM84,$Q$11:$R$200,2,0),\"\"),IF(AM84=J84,\"[/b]\",\"\"),\"..... vs \",IF(AN84=J84,\"[b]\",\"\"),AN84,IF(AND(AN84<>\"\",AN84<>\"(Q)\"),VLOOKUP(AN84,$Q$11:$R$200,2,0),\"\"),IF(AN84=J84,\"[/b]\",\"\"),\"..... ( \",IF(AM84=J84,\"[b]\",\"\"),Коэффициенты!F84,IF(AM84=J84,\"[/b]\",\"\"),\" - \",IF(AN84=J84,\"[b]\",\"\"),Коэффициенты!G84,IF(AN84=J84,\"[/b]\",\"\"),\" )\",IF(J84=\"\",$M$13,\"\"))),\"\"),\"\")","v":""},null,null,null,null,null,null,null,null,null,null,{"$f":"IF(Коэффициенты!L84<>\"\",Коэффициенты!L84,\"\")","v":74},{"$f":"IF(Коэффициенты!M84<>\"\",Коэффициенты!M84,\"\")","v":""},null,null,null,null,null,null,null,null,null,null,null,null,null,null,null,null,null,null,null,null,null,{"$f":"IF(Коэффициенты!D84<>\"\",Коэффициенты!D84,\"\")","v":""},{"$f":"IF(Коэффициенты!E84<>\"\",Коэффициенты!E84,\"\")","v":""},""]
[null,{"$f":"IF(Коэффициенты!B85<>\"\",Коэффициенты!B85,\"\")","v":""},"",{"$f":"IF(Коэффициенты!C85<>\"\",Коэффициенты!C85,\"\")","v":""},{"$f":"IF(AND(AM85<>\"\",AN85<>\"\"),IF(OR(AM85<>\"\",AN85<>\"\"),IF(AN85=\"bye\",CONCATENATE($M$16,AM85,IF(AND(AM85<>\"\",AM85<>\"(Q)\"),VLOOKUP(AM85,$Q$11:$R$200,2,0),\"\"),\"..... vs \",AN85,$M$17),CONCATENATE(IF(J85=\"\",$M$12,\"\"),IF(AM85=J85,\"[b]\",\"\"),AM85,IF(AND(AM85<>\"\",AM85<>\"(Q)\"),VLOOKUP(AM85,$Q$11:$R$200,2,0),\"\"),IF(AM85=J85,\"[/b]\",\"\"),\"..... vs \",IF(AN85=J85,\"[b]\",\"\"),AN85,IF(AND(AN85<>\"\",AN85<>\"(Q)\"),VLOOKUP(AN85,$Q$11:$R$200,2,0),\"\"),IF(AN85=J85,\"[/b]\",\"\"),\"..... ( \",IF(AM85=J85,\"[b]\",\"\"),Коэффициенты!F85,IF(AM85=J85,\"[/b]\",\"\"),\" - \",IF(AN85=J85,\"[b]\",\"\"),Коэффициенты!G85,IF(AN85=J85,\"[/b]\",\"\"),\" )\",IF(J85=\"\",$M$13,\"\"))),\"\"),\"\")","v":""},null,null,null,null,null,null,null,null,null,null,{"$f":"IF(Коэффициенты!L85<>\"\",Коэффициенты!L85,\"\")","v":75},{"$f":"IF(Коэффициенты!M85<>\"\",Коэффициенты!M85,\"\")","v":""},null,null,null,null,null,null,null,null,null,null,null,null,null,null,null,null,null,null,null,null,null,{"$f":"IF(Коэффициенты!D85<>\"\",Коэффициенты!D85,\"\")","v":""},{"$f":"IF(Коэффициенты!E85<>\"\",Коэффициенты!E85,\"\")","v":""},""]
[null,{"$f":"IF(Коэффициенты!B86<>\"\",Коэффициенты!B86,\"\")","v":""},"",{"$f":"IF(Коэффициенты!C86<>\"\",Коэффициенты!C86,\"\")","v":""},{"$f":"IF(AND(AM86<>\"\",AN86<>\"\"),IF(OR(AM86<>\"\",AN86<>\"\"),IF(AN86=\"bye\",CONCATENATE($M$16,AM86,IF(AND(AM86<>\"\",AM86<>\"(Q)\"),VLOOKUP(AM86,$Q$11:$R$200,2,0),\"\"),\"..... vs \",AN86,$M$17),CONCATENATE(IF(J86=\"\",$M$12,\"\"),IF(AM86=J86,\"[b]\",\"\"),AM86,IF(AND(AM86<>\"\",AM86<>\"(Q)\"),VLOOKUP(AM86,$Q$11:$R$200,2,0),\"\"),IF(AM86=J86,\"[/b]\",\"\"),\"..... vs \",IF(AN86=J86,\"[b]\",\"\"),AN86,IF(AND(AN86<>\"\",AN86<>\"(Q)\"),VLOOKUP(AN86,$Q$11:$R$200,2,0),\"\"),IF(AN86=J86,\"[/b]\",\"\"),\"..... ( \",IF(AM86=J86,\"[b]\",\"\"),Коэффициенты!F86,IF(AM86=J86,\"[/b]\",\"\"),\" - \",IF(AN86=J86,\"[b]\",\"\"),Коэффициенты!G86,IF(AN86=J86,\"[/b]\",\"\"),\" )\",IF(J86=\"\",$M$13,\"\"))),\"\"),\"\")","v":""},null,null,null,null,null,null,null,null,null,null,{"$f":"IF(Коэффициенты!L86<>\"\",Коэффициенты!L86,\"\")","v":76},{"$f":"IF(Коэффициенты!M86<>\"\",Коэффициенты!M86,\"\")","v":""},null,null,null,null,null,null,null,null,null,null,null,null,null,null,null,null,null,null,null,null,null,{"$f":"IF(Коэффициенты!D86<>\"\",Коэффициенты!D86,\"\")","v":""},{"$f":"IF(Коэффициенты!E86<>\"\",Коэффициенты!E86,\"\")","v":""},""]
[null,{"$f":"IF(Коэффициенты!B87<>\"\",Коэффициенты!B87,\"\")","v":""},"",{"$f":"IF(Коэффициенты!C87<>\"\",Коэффициенты!C87,\"\")","v":""},{"$f":"IF(AND(AM87<>\"\",AN87<>\"\"),IF(OR(AM87<>\"\",AN87<>\"\"),IF(AN87=\"bye\",CONCATENATE($M$16,AM87,IF(AND(AM87<>\"\",AM87<>\"(Q)\"),VLOOKUP(AM87,$Q$11:$R$200,2,0),\"\"),\"..... vs \",AN87,$M$17),CONCATENATE(IF(J87=\"\",$M$12,\"\"),IF(AM87=J87,\"[b]\",\"\"),AM87,IF(AND(AM87<>\"\",AM87<>\"(Q)\"),VLOOKUP(AM87,$Q$11:$R$200,2,0),\"\"),IF(AM87=J87,\"[/b]\",\"\"),\"..... vs \",IF(AN87=J87,\"[b]\",\"\"),AN87,IF(AND(AN87<>\"\",AN87<>\"(Q)\"),VLOOKUP(AN87,$Q$11:$R$200,2,0),\"\"),IF(AN87=J87,\"[/b]\",\"\"),\"..... ( \",IF(AM87=J87,\"[b]\",\"\"),Коэффициенты!F87,IF(AM87=J87,\"[/b]\",\"\"),\" - \",IF(AN87=J87,\"[b]\",\"\"),Коэффициенты!G87,IF(AN87=J87,\"[/b]\",\"\"),\" )\",IF(J87=\"\",$M$13,\"\"))),\"\"),\"\")","v":""},null,null,null,null,null,null,null,null,null,null,{"$f":"IF(Коэффициенты!L87<>\"\",Коэффициенты!L87,\"\")","v":77},{"$f":"IF(Коэффициенты!M87<>\"\",Коэффициенты!M87,\"\")","v":""},null,null,null,null,null,null,null,null,null,null,null,null,null,null,null,null,null,null,null,null,null,{"$f":"IF(Коэффициенты!D87<>\"\",Коэффициенты!D87,\"\")","v":""},{"$f":"IF(Коэффициенты!E87<>\"\",Коэффициенты!E87,\"\")","v":""},""]
[null,{"$f":"IF(Коэффициенты!B88<>\"\",Коэффициенты!B88,\"\")","v":""},"",{"$f":"IF(Коэффициенты!C88<>\"\",Коэффициенты!C88,\"\")","v":""},{"$f":"IF(AND(AM88<>\"\",AN88<>\"\"),IF(OR(AM88<>\"\",AN88<>\"\"),IF(AN88=\"bye\",CONCATENATE($M$16,AM88,IF(AND(AM88<>\"\",AM88<>\"(Q)\"),VLOOKUP(AM88,$Q$11:$R$200,2,0),\"\"),\"..... vs \",AN88,$M$17),CONCATENATE(IF(J88=\"\",$M$12,\"\"),IF(AM88=J88,\"[b]\",\"\"),AM88,IF(AND(AM88<>\"\",AM88<>\"(Q)\"),VLOOKUP(AM88,$Q$11:$R$200,2,0),\"\"),IF(AM88=J88,\"[/b]\",\"\"),\"..... vs \",IF(AN88=J88,\"[b]\",\"\"),AN88,IF(AND(AN88<>\"\",AN88<>\"(Q)\"),VLOOKUP(AN88,$Q$11:$R$200,2,0),\"\"),IF(AN88=J88,\"[/b]\",\"\"),\"..... ( \",IF(AM88=J88,\"[b]\",\"\"),Коэффициенты!F88,IF(AM88=J88,\"[/b]\",\"\"),\" - \",IF(AN88=J88,\"[b]\",\"\"),Коэффициенты!G88,IF(AN88=J88,\"[/b]\",\"\"),\" )\",IF(J88=\"\",$M$13,\"\"))),\"\"),\"\")","v":""},null,null,null,null,null,null,null,null,null,null,{"$f":"IF(Коэффициенты!L88<>\"\",Коэффициенты!L88,\"\")","v":78},{"$f":"IF(Коэффициенты!M88<>\"\",Коэффициенты!M88,\"\")","v":""},null,null,null,null,null,null,null,null,null,null,null,null,null,null,null,null,null,null,null,null,null,{"$f":"IF(Коэффициенты!D88<>\"\",Коэффициенты!D88,\"\")","v":""},{"$f":"IF(Коэффициенты!E88<>\"\",Коэффициенты!E88,\"\")","v":""},""]
[null,{"$f":"IF(Коэффициенты!B89<>\"\",Коэффициенты!B89,\"\")","v":""},"",{"$f":"IF(Коэффициенты!C89<>\"\",Коэффициенты!C89,\"\")","v":""},{"$f":"IF(AND(AM89<>\"\",AN89<>\"\"),IF(OR(AM89<>\"\",AN89<>\"\"),IF(AN89=\"bye\",CONCATENATE($M$16,AM89,IF(AND(AM89<>\"\",AM89<>\"(Q)\"),VLOOKUP(AM89,$Q$11:$R$200,2,0),\"\"),\"..... vs \",AN89,$M$17),CONCATENATE(IF(J89=\"\",$M$12,\"\"),IF(AM89=J89,\"[b]\",\"\"),AM89,IF(AND(AM89<>\"\",AM89<>\"(Q)\"),VLOOKUP(AM89,$Q$11:$R$200,2,0),\"\"),IF(AM89=J89,\"[/b]\",\"\"),\"..... vs \",IF(AN89=J89,\"[b]\",\"\"),AN89,IF(AND(AN89<>\"\",AN89<>\"(Q)\"),VLOOKUP(AN89,$Q$11:$R$200,2,0),\"\"),IF(AN89=J89,\"[/b]\",\"\"),\"..... ( \",IF(AM89=J89,\"[b]\",\"\"),Коэффициенты!F89,IF(AM89=J89,\"[/b]\",\"\"),\" - \",IF(AN89=J89,\"[b]\",\"\"),Коэффициенты!G89,IF(AN89=J89,\"[/b]\",\"\"),\" )\",IF(J89=\"\",$M$13,\"\"))),\"\"),\"\")","v":""},null,null,null,null,null,null,null,null,null,null,{"$f":"IF(Коэффициенты!L89<>\"\",Коэффициенты!L89,\"\")","v":79},{"$f":"IF(Коэффициенты!M89<>\"\",Коэффициенты!M89,\"\")","v":""},null,null,null,null,null,null,null,null,null,null,null,null,null,null,null,null,null,null,null,null,null,{"$f":"IF(Коэффициенты!D89<>\"\",Коэффициенты!D89,\"\")","v":""},{"$f":"IF(Коэффициенты!E89<>\"\",Коэффициенты!E89,\"\")","v":""},""]
[null,{"$f":"IF(Коэффициенты!B90<>\"\",Коэффициенты!B90,\"\")","v":""},"",{"$f":"IF(Коэффициенты!C90<>\"\",Коэффициенты!C90,\"\")","v":""},{"$f":"IF(AND(AM90<>\"\",AN90<>\"\"),IF(OR(AM90<>\"\",AN90<>\"\"),IF(AN90=\"bye\",CONCATENATE($M$16,AM90,IF(AND(AM90<>\"\",AM90<>\"(Q)\"),VLOOKUP(AM90,$Q$11:$R$200,2,0),\"\"),\"..... vs \",AN90,$M$17),CONCATENATE(IF(J90=\"\",$M$12,\"\"),IF(AM90=J90,\"[b]\",\"\"),AM90,IF(AND(AM90<>\"\",AM90<>\"(Q)\"),VLOOKUP(AM90,$Q$11:$R$200,2,0),\"\"),IF(AM90=J90,\"[/b]\",\"\"),\"..... vs \",IF(AN90=J90,\"[b]\",\"\"),AN90,IF(AND(AN90<>\"\",AN90<>\"(Q)\"),VLOOKUP(AN90,$Q$11:$R$200,2,0),\"\"),IF(AN90=J90,\"[/b]\",\"\"),\"..... ( \",IF(AM90=J90,\"[b]\",\"\"),Коэффициенты!F90,IF(AM90=J90,\"[/b]\",\"\"),\" - \",IF(AN90=J90,\"[b]\",\"\"),Коэффициенты!G90,IF(AN90=J90,\"[/b]\",\"\"),\" )\",IF(J90=\"\",$M$13,\"\"))),\"\"),\"\")","v":""},null,null,null,null,null,null,null,null,null,null,{"$f":"IF(Коэффициенты!L90<>\"\",Коэффициенты!L90,\"\")","v":80},{"$f":"IF(Коэффициенты!M90<>\"\",Коэффициенты!M90,\"\")","v":""},null,null,null,null,null,null,null,null,null,null,null,null,null,null,null,null,null,null,null,null,null,{"$f":"IF(Коэффициенты!D90<>\"\",Коэффициенты!D90,\"\")","v":""},{"$f":"IF(Коэффициенты!E90<>\"\",Коэффициенты!E90,\"\")","v":""},""]
[null,{"$f":"IF(Коэффициенты!B91<>\"\",Коэффициенты!B91,\"\")","v":""},"",{"$f":"IF(Коэффициенты!C91<>\"\",Коэффициенты!C91,\"\")","v":""},{"$f":"IF(AND(AM91<>\"\",AN91<>\"\"),IF(OR(AM91<>\"\",AN91<>\"\"),IF(AN91=\"bye\",CONCATENATE($M$16,AM91,IF(AND(AM91<>\"\",AM91<>\"(Q)\"),VLOOKUP(AM91,$Q$11:$R$200,2,0),\"\"),\"..... vs \",AN91,$M$17),CONCATENATE(IF(J91=\"\",$M$12,\"\"),IF(AM91=J91,\"[b]\",\"\"),AM91,IF(AND(AM91<>\"\",AM91<>\"(Q)\"),VLOOKUP(AM91,$Q$11:$R$200,2,0),\"\"),IF(AM91=J91,\"[/b]\",\"\"),\"..... vs \",IF(AN91=J91,\"[b]\",\"\"),AN91,IF(AND(AN91<>\"\",AN91<>\"(Q)\"),VLOOKUP(AN91,$Q$11:$R$200,2,0),\"\"),IF(AN91=J91,\"[/b]\",\"\"),\"..... ( \",IF(AM91=J91,\"[b]\",\"\"),Коэффициенты!F91,IF(AM91=J91,\"[/b]\",\"\"),\" - \",IF(AN91=J91,\"[b]\",\"\"),Коэффициенты!G91,IF(AN91=J91,\"[/b]\",\"\"),\" )\",IF(J91=\"\",$M$13,\"\"))),\"\"),\"\")","v":""},null,null,null,null,null,null,null,null,null,null,{"$f":"IF(Коэффициенты!L91<>\"\",Коэффициенты!L91,\"\")","v":81},{"$f":"IF(Коэффициенты!M91<>\"\",Коэффициенты!M91,\"\")","v":""},null,null,null,null,null,null,null,null,null,null,null,null,null,null,null,null,null,null,null,null,null,{"$f":"IF(Коэффициенты!D91<>\"\",Коэффициенты!D91,\"\")","v":""},{"$f":"IF(Коэффициенты!E91<>\"\",Коэффициенты!E91,\"\")","v":""},""]
[null,{"$f":"IF(Коэффициенты!B92<>\"\",Коэффициенты!B92,\"\")","v":""},"",{"$f":"IF(Коэффициенты!C92<>\"\",Коэффициенты!C92,\"\")","v":""},{"$f":"IF(AND(AM92<>\"\",AN92<>\"\"),IF(OR(AM92<>\"\",AN92<>\"\"),IF(AN92=\"bye\",CONCATENATE($M$16,AM92,IF(AND(AM92<>\"\",AM92<>\"(Q)\"),VLOOKUP(AM92,$Q$11:$R$200,2,0),\"\"),\"..... vs \",AN92,$M$17),CONCATENATE(IF(J92=\"\",$M$12,\"\"),IF(AM92=J92,\"[b]\",\"\"),AM92,IF(AND(AM92<>\"\",AM92<>\"(Q)\"),VLOOKUP(AM92,$Q$11:$R$200,2,0),\"\"),IF(AM92=J92,\"[/b]\",\"\"),\"..... vs \",IF(AN92=J92,\"[b]\",\"\"),AN92,IF(AND(AN92<>\"\",AN92<>\"(Q)\"),VLOOKUP(AN92,$Q$11:$R$200,2,0),\"\"),IF(AN92=J92,\"[/b]\",\"\"),\"..... ( \",IF(AM92=J92,\"[b]\",\"\"),Коэффициенты!F92,IF(AM92=J92,\"[/b]\",\"\"),\" - \",IF(AN92=J92,\"[b]\",\"\"),Коэффициенты!G92,IF(AN92=J92,\"[/b]\",\"\"),\" )\",IF(J92=\"\",$M$13,\"\"))),\"\"),\"\")","v":""},null,null,null,null,null,null,null,null,null,null,{"$f":"IF(Коэффициенты!L92<>\"\",Коэффициенты!L92,\"\")","v":82},{"$f":"IF(Коэффициенты!M92<>\"\",Коэффициенты!M92,\"\")","v":""},null,null,null,null,null,null,null,null,null,null,null,null,null,null,null,null,null,null,null,null,null,{"$f":"IF(Коэффициенты!D92<>\"\",Коэффициенты!D92,\"\")","v":""},{"$f":"IF(Коэффициенты!E92<>\"\",Коэффициенты!E92,\"\")","v":""},""]
[null,{"$f":"IF(Коэффициенты!B93<>\"\",Коэффициенты!B93,\"\")","v":""},"",{"$f":"IF(Коэффициенты!C93<>\"\",Коэффициенты!C93,\"\")","v":""},{"$f":"IF(AND(AM93<>\"\",AN93<>\"\"),IF(OR(AM93<>\"\",AN93<>\"\"),IF(AN93=\"bye\",CONCATENATE($M$16,AM93,IF(AND(AM93<>\"\",AM93<>\"(Q)\"),VLOOKUP(AM93,$Q$11:$R$200,2,0),\"\"),\"..... vs \",AN93,$M$17),CONCATENATE(IF(J93=\"\",$M$12,\"\"),IF(AM93=J93,\"[b]\",\"\"),AM93,IF(AND(AM93<>\"\",AM93<>\"(Q)\"),VLOOKUP(AM93,$Q$11:$R$200,2,0),\"\"),IF(AM93=J93,\"[/b]\",\"\"),\"..... vs \",IF(AN93=J93,\"[b]\",\"\"),AN93,IF(AND(AN93<>\"\",AN93<>\"(Q)\"),VLOOKUP(AN93,$Q$11:$R$200,2,0),\"\"),IF(AN93=J93,\"[/b]\",\"\"),\"..... ( \",IF(AM93=J93,\"[b]\",\"\"),Коэффициенты!F93,IF(AM93=J93,\"[/b]\",\"\"),\" - \",IF(AN93=J93,\"[b]\",\"\"),Коэффициенты!G93,IF(AN93=J93,\"[/b]\",\"\"),\" )\",IF(J93=\"\",$M$13,\"\"))),\"\"),\"\")","v":""},null,null,null,null,null,null,null,null,null,null,{"$f":"IF(Коэффициенты!L93<>\"\",Коэффициенты!L93,\"\")","v":83},{"$f":"IF(Коэффициенты!M93<>\"\",Коэффициенты!M93,\"\")","v":""},null,null,null,null,null,null,null,null,null,null,null,null,null,null,null,null,null,null,null,null,null,{"$f":"IF(Коэффициенты!D93<>\"\",Коэффициенты!D93,\"\")","v":""},{"$f":"IF(Коэффициенты!E93<>\"\",Коэффициенты!E93,\"\")","v":""},""]
[null,{"$f":"IF(Коэффициенты!B94<>\"\",Коэффициенты!B94,\"\")","v":""},"",{"$f":"IF(Коэффициенты!C94<>\"\",Коэффициенты!C94,\"\")","v":""},{"$f":"IF(AND(AM94<>\"\",AN94<>\"\"),IF(OR(AM94<>\"\",AN94<>\"\"),IF(AN94=\"bye\",CONCATENATE($M$16,AM94,IF(AND(AM94<>\"\",AM94<>\"(Q)\"),VLOOKUP(AM94,$Q$11:$R$200,2,0),\"\"),\"..... vs \",AN94,$M$17),CONCATENATE(IF(J94=\"\",$M$12,\"\"),IF(AM94=J94,\"[b]\",\"\"),AM94,IF(AND(AM94<>\"\",AM94<>\"(Q)\"),VLOOKUP(AM94,$Q$11:$R$200,2,0),\"\"),IF(AM94=J94,\"[/b]\",\"\"),\"..... vs \",IF(AN94=J94,\"[b]\",\"\"),AN94,IF(AND(AN94<>\"\",AN94<>\"(Q)\"),VLOOKUP(AN94,$Q$11:$R$200,2,0),\"\"),IF(AN94=J94,\"[/b]\",\"\"),\"..... ( \",IF(AM94=J94,\"[b]\",\"\"),Коэффициенты!F94,IF(AM94=J94,\"[/b]\",\"\"),\" - \",IF(AN94=J94,\"[b]\",\"\"),Коэффициенты!G94,IF(AN94=J94,\"[/b]\",\"\"),\" )\",IF(J94=\"\",$M$13,\"\"))),\"\"),\"\")","v":""},null,null,null,null,null,null,null,null,null,null,{"$f":"IF(Коэффициенты!L94<>\"\",Коэффициенты!L94,\"\")","v":84},{"$f":"IF(Коэффициенты!M94<>\"\",Коэффициенты!M94,\"\")","v":""},null,null,null,null,null,null,null,null,null,null,null,null,null,null,null,null,null,null,null,null,null,{"$f":"IF(Коэффициенты!D94<>\"\",Коэффициенты!D94,\"\")","v":""},{"$f":"IF(Коэффициенты!E94<>\"\",Коэффициенты!E94,\"\")","v":""},""]
[null,{"$f":"IF(Коэффициенты!B95<>\"\",Коэффициенты!B95,\"\")","v":""},"",{"$f":"IF(Коэффициенты!C95<>\"\",Коэффициенты!C95,\"\")","v":""},{"$f":"IF(AND(AM95<>\"\",AN95<>\"\"),IF(OR(AM95<>\"\",AN95<>\"\"),IF(AN95=\"bye\",CONCATENATE($M$16,AM95,IF(AND(AM95<>\"\",AM95<>\"(Q)\"),VLOOKUP(AM95,$Q$11:$R$200,2,0),\"\"),\"..... vs \",AN95,$M$17),CONCATENATE(IF(J95=\"\",$M$12,\"\"),IF(AM95=J95,\"[b]\",\"\"),AM95,IF(AND(AM95<>\"\",AM95<>\"(Q)\"),VLOOKUP(AM95,$Q$11:$R$200,2,0),\"\"),IF(AM95=J95,\"[/b]\",\"\"),\"..... vs \",IF(AN95=J95,\"[b]\",\"\"),AN95,IF(AND(AN95<>\"\",AN95<>\"(Q)\"),VLOOKUP(AN95,$Q$11:$R$200,2,0),\"\"),IF(AN95=J95,\"[/b]\",\"\"),\"..... ( \",IF(AM95=J95,\"[b]\",\"\"),Коэффициенты!F95,IF(AM95=J95,\"[/b]\",\"\"),\" - \",IF(AN95=J95,\"[b]\",\"\"),Коэффициенты!G95,IF(AN95=J95,\"[/b]\",\"\"),\" )\",IF(J95=\"\",$M$13,\"\"))),\"\"),\"\")","v":""},null,null,null,null,null,null,null,null,null,null,{"$f":"IF(Коэффициенты!L95<>\"\",Коэффициенты!L95,\"\")","v":85},{"$f":"IF(Коэффициенты!M95<>\"\",Коэффициенты!M95,\"\")","v":""},null,null,null,null,null,null,null,null,null,null,null,null,null,null,null,null,null,null,null,null,null,{"$f":"IF(Коэффициенты!D95<>\"\",Коэффициенты!D95,\"\")","v":""},{"$f":"IF(Коэффициенты!E95<>\"\",Коэффициенты!E95,\"\")","v":""},""]
[null,{"$f":"IF(Коэффициенты!B96<>\"\",Коэффициенты!B96,\"\")","v":""},"",{"$f":"IF(Коэффициенты!C96<>\"\",Коэффициенты!C96,\"\")","v":""},{"$f":"IF(AND(AM96<>\"\",AN96<>\"\"),IF(OR(AM96<>\"\",AN96<>\"\"),IF(AN96=\"bye\",CONCATENATE($M$16,AM96,IF(AND(AM96<>\"\",AM96<>\"(Q)\"),VLOOKUP(AM96,$Q$11:$R$200,2,0),\"\"),\"..... vs \",AN96,$M$17),CONCATENATE(IF(J96=\"\",$M$12,\"\"),IF(AM96=J96,\"[b]\",\"\"),AM96,IF(AND(AM96<>\"\",AM96<>\"(Q)\"),VLOOKUP(AM96,$Q$11:$R$200,2,0),\"\"),IF(AM96=J96,\"[/b]\",\"\"),\"..... vs \",IF(AN96=J96,\"[b]\",\"\"),AN96,IF(AND(AN96<>\"\",AN96<>\"(Q)\"),VLOOKUP(AN96,$Q$11:$R$200,2,0),\"\"),IF(AN96=J96,\"[/b]\",\"\"),\"..... ( \",IF(AM96=J96,\"[b]\",\"\"),Коэффициенты!F96,IF(AM96=J96,\"[/b]\",\"\"),\" - \",IF(AN96=J96,\"[b]\",\"\"),Коэффициенты!G96,IF(AN96=J96,\"[/b]\",\"\"),\" )\",IF(J96=\"\",$M$13,\"\"))),\"\"),\"\")","v":""},null,null,null,null,null,null,null,null,null,null,{"$f":"IF(Коэффициенты!L96<>\"\",Коэффициенты!L96,\"\")","v":86},{"$f":"IF(Коэффициенты!M96<>\"\",Коэффициенты!M96,\"\")","v":""},null,null,null,null,null,null,null,null,null,null,null,null,null,null,null,null,null,null,null,null,null,{"$f":"IF(Коэффициенты!D96<>\"\",Коэффициенты!D96,\"\")","v":""},{"$f":"IF(Коэффициенты!E96<>\"\",Коэффициенты!E96,\"\")","v":""},""]
[null,{"$f":"IF(Коэффициенты!B97<>\"\",Коэффициенты!B97,\"\")","v":""},"",{"$f":"IF(Коэффициенты!C97<>\"\",Коэффициенты!C97,\"\")","v":""},{"$f":"IF(AND(AM97<>\"\",AN97<>\"\"),IF(OR(AM97<>\"\",AN97<>\"\"),IF(AN97=\"bye\",CONCATENATE($M$16,AM97,IF(AND(AM97<>\"\",AM97<>\"(Q)\"),VLOOKUP(AM97,$Q$11:$R$200,2,0),\"\"),\"..... vs \",AN97,$M$17),CONCATENATE(IF(J97=\"\",$M$12,\"\"),IF(AM97=J97,\"[b]\",\"\"),AM97,IF(AND(AM97<>\"\",AM97<>\"(Q)\"),VLOOKUP(AM97,$Q$11:$R$200,2,0),\"\"),IF(AM97=J97,\"[/b]\",\"\"),\"..... vs \",IF(AN97=J97,\"[b]\",\"\"),AN97,IF(AND(AN97<>\"\",AN97<>\"(Q)\"),VLOOKUP(AN97,$Q$11:$R$200,2,0),\"\"),IF(AN97=J97,\"[/b]\",\"\"),\"..... ( \",IF(AM97=J97,\"[b]\",\"\"),Коэффициенты!F97,IF(AM97=J97,\"[/b]\",\"\"),\" - \",IF(AN97=J97,\"[b]\",\"\"),Коэффициенты!G97,IF(AN97=J97,\"[/b]\",\"\"),\" )\",IF(J97=\"\",$M$13,\"\"))),\"\"),\"\")","v":""},null,null,null,null,null,null,null,null,null,null,{"$f":"IF(Коэффициенты!L97<>\"\",Коэффициенты!L97,\"\")","v":87},{"$f":"IF(Коэффициенты!M97<>\"\",Коэффициенты!M97,\"\")","v":""},null,null,null,null,null,null,null,null,null,null,null,null,null,null,null,null,null,null,null,null,null,{"$f":"IF(Коэффициенты!D97<>\"\",Коэффициенты!D97,\"\")","v":""},{"$f":"IF(Коэффициенты!E97<>\"\",Коэффициенты!E97,\"\")","v":""},""]
[null,{"$f":"IF(Коэффициенты!B98<>\"\",Коэффициенты!B98,\"\")","v":""},"",{"$f":"IF(Коэффициенты!C98<>\"\",Коэффициенты!C98,\"\")","v":""},{"$f":"IF(AND(AM98<>\"\",AN98<>\"\"),IF(OR(AM98<>\"\",AN98<>\"\"),IF(AN98=\"bye\",CONCATENATE($M$16,AM98,IF(AND(AM98<>\"\",AM98<>\"(Q)\"),VLOOKUP(AM98,$Q$11:$R$200,2,0),\"\"),\"..... vs \",AN98,$M$17),CONCATENATE(IF(J98=\"\",$M$12,\"\"),IF(AM98=J98,\"[b]\",\"\"),AM98,IF(AND(AM98<>\"\",AM98<>\"(Q)\"),VLOOKUP(AM98,$Q$11:$R$200,2,0),\"\"),IF(AM98=J98,\"[/b]\",\"\"),\"..... vs \",IF(AN98=J98,\"[b]\",\"\"),AN98,IF(AND(AN98<>\"\",AN98<>\"(Q)\"),VLOOKUP(AN98,$Q$11:$R$200,2,0),\"\"),IF(AN98=J98,\"[/b]\",\"\"),\"..... ( \",IF(AM98=J98,\"[b]\",\"\"),Коэффициенты!F98,IF(AM98=J98,\"[/b]\",\"\"),\" - \",IF(AN98=J98,\"[b]\",\"\"),Коэффициенты!G98,IF(AN98=J98,\"[/b]\",\"\"),\" )\",IF(J98=\"\",$M$13,\"\"))),\"\"),\"\")","v":""},null,null,null,null,null,null,null,null,null,null,{"$f":"IF(Коэффициенты!L98<>\"\",Коэффициенты!L98,\"\")","v":88},{"$f":"IF(Коэффициенты!M98<>\"\",Коэффициенты!M98,\"\")","v":""},null,null,null,null,null,null,null,null,null,null,null,null,null,null,null,null,null,null,null,null,null,{"$f":"IF(Коэффициенты!D98<>\"\",Коэффициенты!D98,\"\")","v":""},{"$f":"IF(Коэффициенты!E98<>\"\",Коэффициенты!E98,\"\")","v":""},""]
[null,{"$f":"IF(Коэффициенты!B99<>\"\",Коэффициенты!B99,\"\")","v":""},"",{"$f":"IF(Коэффициенты!C99<>\"\",Коэффициенты!C99,\"\")","v":""},{"$f":"IF(AND(AM99<>\"\",AN99<>\"\"),IF(OR(AM99<>\"\",AN99<>\"\"),IF(AN99=\"bye\",CONCATENATE($M$16,AM99,IF(AND(AM99<>\"\",AM99<>\"(Q)\"),VLOOKUP(AM99,$Q$11:$R$200,2,0),\"\"),\"..... vs \",AN99,$M$17),CONCATENATE(IF(J99=\"\",$M$12,\"\"),IF(AM99=J99,\"[b]\",\"\"),AM99,IF(AND(AM99<>\"\",AM99<>\"(Q)\"),VLOOKUP(AM99,$Q$11:$R$200,2,0),\"\"),IF(AM99=J99,\"[/b]\",\"\"),\"..... vs \",IF(AN99=J99,\"[b]\",\"\"),AN99,IF(AND(AN99<>\"\",AN99<>\"(Q)\"),VLOOKUP(AN99,$Q$11:$R$200,2,0),\"\"),IF(AN99=J99,\"[/b]\",\"\"),\"..... ( \",IF(AM99=J99,\"[b]\",\"\"),Коэффициенты!F99,IF(AM99=J99,\"[/b]\",\"\"),\" - \",IF(AN99=J99,\"[b]\",\"\"),Коэффициенты!G99,IF(AN99=J99,\"[/b]\",\"\"),\" )\",IF(J99=\"\",$M$13,\"\"))),\"\"),\"\")","v":""},null,null,null,null,null,null,null,null,null,null,{"$f":"IF(Коэффициенты!L99<>\"\",Коэффициенты!L99,\"\")","v":89},{"$f":"IF(Коэффициенты!M99<>\"\",Коэффициенты!M99,\"\")","v":""},null,null,null,null,null,null,null,null,null,null,null,null,null,null,null,null,null,null,null,null,null,{"$f":"IF(Коэффициенты!D99<>\"\",Коэффициенты!D99,\"\")","v":""},{"$f":"IF(Коэффициенты!E99<>\"\",Коэффициенты!E99,\"\")","v":""},""]
[null,{"$f":"IF(Коэффициенты!B100<>\"\",Коэффициенты!B100,\"\")","v":""},"",{"$f":"IF(Коэффициенты!C100<>\"\",Коэффициенты!C100,\"\")","v":""},{"$f":"IF(AND(AM100<>\"\",AN100<>\"\"),IF(OR(AM100<>\"\",AN100<>\"\"),IF(AN100=\"bye\",CONCATENATE($M$16,AM100,IF(AND(AM100<>\"\",AM100<>\"(Q)\"),VLOOKUP(AM100,$Q$11:$R$200,2,0),\"\"),\"..... vs \",AN100,$M$17),CONCATENATE(IF(J100=\"\",$M$12,\"\"),IF(AM100=J100,\"[b]\",\"\"),AM100,IF(AND(AM100<>\"\",AM100<>\"(Q)\"),VLOOKUP(AM100,$Q$11:$R$200,2,0),\"\"),IF(AM100=J100,\"[/b]\",\"\"),\"..... vs \",IF(AN100=J100,\"[b]\",\"\"),AN100,IF(AND(AN100<>\"\",AN100<>\"(Q)\"),VLOOKUP(AN100,$Q$11:$R$200,2,0),\"\"),IF(AN100=J100,\"[/b]\",\"\"),\"..... ( \",IF(AM100=J100,\"[b]\",\"\"),Коэффициенты!F100,IF(AM100=J100,\"[/b]\",\"\"),\" - \",IF(AN100=J100,\"[b]\",\"\"),Коэффициенты!G100,IF(AN100=J100,\"[/b]\",\"\"),\" )\",IF(J100=\"\",$M$13,\"\"))),\"\"),\"\")","v":""},null,null,null,null,null,null,null,null,null,null,{"$f":"IF(Коэффициенты!L100<>\"\",Коэффициенты!L100,\"\")","v":90},{"$f":"IF(Коэффициенты!M100<>\"\",Коэффициенты!M100,\"\")","v":""},null,null,null,null,null,null,null,null,null,null,null,null,null,null,null,null,null,null,null,null,null,{"$f":"IF(Коэффициенты!D100<>\"\",Коэффициенты!D100,\"\")","v":""},{"$f":"IF(Коэффициенты!E100<>\"\",Коэффициенты!E100,\"\")","v":""},""]
[null,{"$f":"IF(Коэффициенты!B101<>\"\",Коэффициенты!B101,\"\")","v":""},"",{"$f":"IF(Коэффициенты!C101<>\"\",Коэффициенты!C101,\"\")","v":""},{"$f":"IF(AND(AM101<>\"\",AN101<>\"\"),IF(OR(AM101<>\"\",AN101<>\"\"),IF(AN101=\"bye\",CONCATENATE($M$16,AM101,IF(AND(AM101<>\"\",AM101<>\"(Q)\"),VLOOKUP(AM101,$Q$11:$R$200,2,0),\"\"),\"..... vs \",AN101,$M$17),CONCATENATE(IF(J101=\"\",$M$12,\"\"),IF(AM101=J101,\"[b]\",\"\"),AM101,IF(AND(AM101<>\"\",AM101<>\"(Q)\"),VLOOKUP(AM101,$Q$11:$R$200,2,0),\"\"),IF(AM101=J101,\"[/b]\",\"\"),\"..... vs \",IF(AN101=J101,\"[b]\",\"\"),AN101,IF(AND(AN101<>\"\",AN101<>\"(Q)\"),VLOOKUP(AN101,$Q$11:$R$200,2,0),\"\"),IF(AN101=J101,\"[/b]\",\"\"),\"..... ( \",IF(AM101=J101,\"[b]\",\"\"),Коэффициенты!F101,IF(AM101=J101,\"[/b]\",\"\"),\" - \",IF(AN101=J101,\"[b]\",\"\"),Коэффициенты!G101,IF(AN101=J101,\"[/b]\",\"\"),\" )\",IF(J101=\"\",$M$13,\"\"))),\"\"),\"\")","v":""},null,null,null,null,null,null,null,null,null,null,{"$f":"IF(Коэффициенты!L101<>\"\",Коэффициенты!L101,\"\")","v":91},{"$f":"IF(Коэффициенты!M101<>\"\",Коэффициенты!M101,\"\")","v":""},null,null,null,null,null,null,null,null,null,null,null,null,null,null,null,null,null,null,null,null,null,{"$f":"IF(Коэффициенты!D101<>\"\",Коэффициенты!D101,\"\")","v":""},{"$f":"IF(Коэффициенты!E101<>\"\",Коэффициенты!E101,\"\")","v":""},""]
[null,{"$f":"IF(Коэффициенты!B102<>\"\",Коэффициенты!B102,\"\")","v":""},"",{"$f":"IF(Коэффициенты!C102<>\"\",Коэффициенты!C102,\"\")","v":""},{"$f":"IF(AND(AM102<>\"\",AN102<>\"\"),IF(OR(AM102<>\"\",AN102<>\"\"),IF(AN102=\"bye\",CONCATENATE($M$16,AM102,IF(AND(AM102<>\"\",AM102<>\"(Q)\"),VLOOKUP(AM102,$Q$11:$R$200,2,0),\"\"),\"..... vs \",AN102,$M$17),CONCATENATE(IF(J102=\"\",$M$12,\"\"),IF(AM102=J102,\"[b]\",\"\"),AM102,IF(AND(AM102<>\"\",AM102<>\"(Q)\"),VLOOKUP(AM102,$Q$11:$R$200,2,0),\"\"),IF(AM102=J102,\"[/b]\",\"\"),\"..... vs \",IF(AN102=J102,\"[b]\",\"\"),AN102,IF(AND(AN102<>\"\",AN102<>\"(Q)\"),VLOOKUP(AN102,$Q$11:$R$200,2,0),\"\"),IF(AN102=J102,\"[/b]\",\"\"),\"..... ( \",IF(AM102=J102,\"[b]\",\"\"),Коэффициенты!F102,IF(AM102=J102,\"[/b]\",\"\"),\" - \",IF(AN102=J102,\"[b]\",\"\"),Коэффициенты!G102,IF(AN102=J102,\"[/b]\",\"\"),\" )\",IF(J102=\"\",$M$13,\"\"))),\"\"),\"\")","v":""},null,null,null,null,null,null,null,null,null,null,{"$f":"IF(Коэффициенты!L102<>\"\",Коэффициенты!L102,\"\")","v":92},{"$f":"IF(Коэффициенты!M102<>\"\",Коэффициенты!M102,\"\")","v":""},null,null,null,null,null,null,null,null,null,null,null,null,null,null,null,null,null,null,null,null,null,{"$f":"IF(Коэффициенты!D102<>\"\",Коэффициенты!D102,\"\")","v":""},{"$f":"IF(Коэффициенты!E102<>\"\",Коэффициенты!E102,\"\")","v":""},""]
[null,{"$f":"IF(Коэффициенты!B103<>\"\",Коэффициенты!B103,\"\")","v":""},"",{"$f":"IF(Коэффициенты!C103<>\"\",Коэффициенты!C103,\"\")","v":""},{"$f":"IF(AND(AM103<>\"\",AN103<>\"\"),IF(OR(AM103<>\"\",AN103<>\"\"),IF(AN103=\"bye\",CONCATENATE($M$16,AM103,IF(AND(AM103<>\"\",AM103<>\"(Q)\"),VLOOKUP(AM103,$Q$11:$R$200,2,0),\"\"),\"..... vs \",AN103,$M$17),CONCATENATE(IF(J103=\"\",$M$12,\"\"),IF(AM103=J103,\"[b]\",\"\"),AM103,IF(AND(AM103<>\"\",AM103<>\"(Q)\"),VLOOKUP(AM103,$Q$11:$R$200,2,0),\"\"),IF(AM103=J103,\"[/b]\",\"\"),\"..... vs \",IF(AN103=J103,\"[b]\",\"\"),AN103,IF(AND(AN103<>\"\",AN103<>\"(Q)\"),VLOOKUP(AN103,$Q$11:$R$200,2,0),\"\"),IF(AN103=J103,\"[/b]\",\"\"),\"..... ( \",IF(AM103=J103,\"[b]\",\"\"),Коэффициенты!F103,IF(AM103=J103,\"[/b]\",\"\"),\" - \",IF(AN103=J103,\"[b]\",\"\"),Коэффициенты!G103,IF(AN103=J103,\"[/b]\",\"\"),\" )\",IF(J103=\"\",$M$13,\"\"))),\"\"),\"\")","v":""},null,null,null,null,null,null,null,null,null,null,{"$f":"IF(Коэффициенты!L103<>\"\",Коэффициенты!L103,\"\")","v":93},{"$f":"IF(Коэффициенты!M103<>\"\",Коэффициенты!M103,\"\")","v":""},"(Q)",null,null,null,null,null,null,null,null,null,null,null,null,null,null,null,null,null,null,null,null,{"$f":"IF(Коэффициенты!D103<>\"\",Коэффициенты!D103,\"\")","v":""},{"$f":"IF(Коэффициенты!E103<>\"\",Коэффициенты!E103,\"\")","v":""},""]
[null,{"$f":"IF(Коэффициенты!B104<>\"\",Коэффициенты!B104,\"\")","v":""},"",{"$f":"IF(Коэффициенты!C104<>\"\",Коэффициенты!C104,\"\")","v":""},{"$f":"IF(AND(AM104<>\"\",AN104<>\"\"),IF(OR(AM104<>\"\",AN104<>\"\"),IF(AN104=\"bye\",CONCATENATE($M$16,AM104,IF(AND(AM104<>\"\",AM104<>\"(Q)\"),VLOOKUP(AM104,$Q$11:$R$200,2,0),\"\"),\"..... vs \",AN104,$M$17),CONCATENATE(IF(J104=\"\",$M$12,\"\"),IF(AM104=J104,\"[b]\",\"\"),AM104,IF(AND(AM104<>\"\",AM104<>\"(Q)\"),VLOOKUP(AM104,$Q$11:$R$200,2,0),\"\"),IF(AM104=J104,\"[/b]\",\"\"),\"..... vs \",IF(AN104=J104,\"[b]\",\"\"),AN104,IF(AND(AN104<>\"\",AN104<>\"(Q)\"),VLOOKUP(AN104,$Q$11:$R$200,2,0),\"\"),IF(AN104=J104,\"[/b]\",\"\"),\"..... ( \",IF(AM104=J104,\"[b]\",\"\"),Коэффициенты!F104,IF(AM104=J104,\"[/b]\",\"\"),\" - \",IF(AN104=J104,\"[b]\",\"\"),Коэффициенты!G104,IF(AN104=J104,\"[/b]\",\"\"),\" )\",IF(J104=\"\",$M$13,\"\"))),\"\"),\"\")","v":""},null,null,null,null,null,null,null,null,null,null,{"$f":"IF(Коэффициенты!L104<>\"\",Коэффициенты!L104,\"\")","v":94},{"$f":"IF(Коэффициенты!M104<>\"\",Коэффициенты!M104,\"\")","v":""},null,null,null,null,null,null,null,null,null,null,null,null,null,null,null,null,null,null,null,null,null,{"$f":"IF(Коэффициенты!D104<>\"\",Коэффициенты!D104,\"\")","v":""},{"$f":"IF(Коэффициенты!E104<>\"\",Коэффициенты!E104,\"\")","v":""},""]
[null,{"$f":"IF(Коэффициенты!B105<>\"\",Коэффициенты!B105,\"\")","v":""},"",{"$f":"IF(Коэффициенты!C105<>\"\",Коэффициенты!C105,\"\")","v":""},{"$f":"IF(AND(AM105<>\"\",AN105<>\"\"),IF(OR(AM105<>\"\",AN105<>\"\"),IF(AN105=\"bye\",CONCATENATE($M$16,AM105,IF(AND(AM105<>\"\",AM105<>\"(Q)\"),VLOOKUP(AM105,$Q$11:$R$200,2,0),\"\"),\"..... vs \",AN105,$M$17),CONCATENATE(IF(J105=\"\",$M$12,\"\"),IF(AM105=J105,\"[b]\",\"\"),AM105,IF(AND(AM105<>\"\",AM105<>\"(Q)\"),VLOOKUP(AM105,$Q$11:$R$200,2,0),\"\"),IF(AM105=J105,\"[/b]\",\"\"),\"..... vs \",IF(AN105=J105,\"[b]\",\"\"),AN105,IF(AND(AN105<>\"\",AN105<>\"(Q)\"),VLOOKUP(AN105,$Q$11:$R$200,2,0),\"\"),IF(AN105=J105,\"[/b]\",\"\"),\"..... ( \",IF(AM105=J105,\"[b]\",\"\"),Коэффициенты!F105,IF(AM105=J105,\"[/b]\",\"\"),\" - \",IF(AN105=J105,\"[b]\",\"\"),Коэффициенты!G105,IF(AN105=J105,\"[/b]\",\"\"),\" )\",IF(J105=\"\",$M$13,\"\"))),\"\"),\"\")","v":""},null,null,null,null,null,null,null,null,null,null,{"$f":"IF(Коэффициенты!L105<>\"\",Коэффициенты!L105,\"\")","v":95},{"$f":"IF(Коэффициенты!M105<>\"\",Коэффициенты!M105,\"\")","v":""},null,null,null,null,null,null,null,null,null,null,null,null,null,null,null,null,null,null,null,null,null,{"$f":"IF(Коэффициенты!D105<>\"\",Коэффициенты!D105,\"\")","v":""},{"$f":"IF(Коэффициенты!E105<>\"\",Коэффициенты!E105,\"\")","v":""},""]
[null,{"$f":"IF(Коэффициенты!B106<>\"\",Коэффициенты!B106,\"\")","v":""},"",{"$f":"IF(Коэффициенты!C106<>\"\",Коэффициенты!C106,\"\")","v":""},{"$f":"IF(AND(AM106<>\"\",AN106<>\"\"),IF(OR(AM106<>\"\",AN106<>\"\"),IF(AN106=\"bye\",CONCATENATE($M$16,AM106,IF(AND(AM106<>\"\",AM106<>\"(Q)\"),VLOOKUP(AM106,$Q$11:$R$200,2,0),\"\"),\"..... vs \",AN106,$M$17),CONCATENATE(IF(J106=\"\",$M$12,\"\"),IF(AM106=J106,\"[b]\",\"\"),AM106,IF(AND(AM106<>\"\",AM106<>\"(Q)\"),VLOOKUP(AM106,$Q$11:$R$200,2,0),\"\"),IF(AM106=J106,\"[/b]\",\"\"),\"..... vs \",IF(AN106=J106,\"[b]\",\"\"),AN106,IF(AND(AN106<>\"\",AN106<>\"(Q)\"),VLOOKUP(AN106,$Q$11:$R$200,2,0),\"\"),IF(AN106=J106,\"[/b]\",\"\"),\"..... ( \",IF(AM106=J106,\"[b]\",\"\"),Коэффициенты!F106,IF(AM106=J106,\"[/b]\",\"\"),\" - \",IF(AN106=J106,\"[b]\",\"\"),Коэффициенты!G106,IF(AN106=J106,\"[/b]\",\"\"),\" )\",IF(J106=\"\",$M$13,\"\"))),\"\"),\"\")","v":""},null,null,null,null,null,null,null,null,null,null,{"$f":"IF(Коэффициенты!L106<>\"\",Коэффициенты!L106,\"\")","v":96},{"$f":"IF(Коэффициенты!M106<>\"\",Коэффициенты!M106,\"\")","v":""},null,null,null,null,null,null,null,null,null,null,null,null,null,null,null,null,null,null,null,null,null,{"$f":"IF(Коэффициенты!D106<>\"\",Коэффициенты!D106,\"\")","v":""},{"$f":"IF(Коэффициенты!E106<>\"\",Коэффициенты!E106,\"\")","v":""},""]
[null,{"$f":"IF(Коэффициенты!B107<>\"\",Коэффициенты!B107,\"\")","v":""},{"$f":"IF(B107<>\"\",CONCATENATE($M$20,B107,$M$21),\"\")","v":""},{"$f":"IF(Коэффициенты!C107<>\"\",Коэффициенты!C107,\"\")","v":""},{"$f":"IF(AND(AM107<>\"\",AN107<>\"\"),IF(OR(AM107<>\"\",AN107<>\"\"),IF(AN107=\"bye\",CONCATENATE($M$16,AM107,IF(AND(AM107<>\"\",AM107<>\"(Q)\"),VLOOKUP(AM107,$Q$11:$R$200,2,0),\"\"),\"..... vs \",AN107,$M$17),CONCATENATE(IF(J107=\"\",$M$12,\"\"),IF(AM107=J107,\"[b]\",\"\"),AM107,IF(AND(AM107<>\"\",AM107<>\"(Q)\"),VLOOKUP(AM107,$Q$11:$R$200,2,0),\"\"),IF(AM107=J107,\"[/b]\",\"\"),\"..... vs \",IF(AN107=J107,\"[b]\",\"\"),AN107,IF(AND(AN107<>\"\",AN107<>\"(Q)\"),VLOOKUP(AN107,$Q$11:$R$200,2,0),\"\"),IF(AN107=J107,\"[/b]\",\"\"),\"..... ( \",IF(AM107=J107,\"[b]\",\"\"),Коэффициенты!F107,IF(AM107=J107,\"[/b]\",\"\"),\" - \",IF(AN107=J107,\"[b]\",\"\"),Коэффициенты!G107,IF(AN107=J107,\"[/b]\",\"\"),\" )\",IF(J107=\"\",$M$13,\"\"))),\"\"),\"\")","v":""},null,null,null,null,null,null,null,null,null,null,{"$f":"IF(Коэффициенты!L107<>\"\",Коэффициенты!L107,\"\")","v":97},{"$f":"IF(Коэффициенты!M107<>\"\",Коэффициенты!M107,\"\")","v":""},null,null,null,null,null,null,null,null,null,null,null,null,null,null,null,null,null,null,null,null,null,{"$f":"IF(Коэффициенты!D107<>\"\",Коэффициенты!D107,\"\")","v":""},{"$f":"IF(Коэффициенты!E107<>\"\",Коэффициенты!E107,\"\")","v":""},""]
[null,{"$f":"IF(Коэффициенты!B108<>\"\",Коэффициенты!B108,\"\")","v":""},"",{"$f":"IF(Коэффициенты!C108<>\"\",Коэффициенты!C108,\"\")","v":""},{"$f":"IF(AND(AM108<>\"\",AN108<>\"\"),IF(OR(AM108<>\"\",AN108<>\"\"),IF(AN108=\"bye\",CONCATENATE($M$16,AM108,IF(AND(AM108<>\"\",AM108<>\"(Q)\"),VLOOKUP(AM108,$Q$11:$R$200,2,0),\"\"),\"..... vs \",AN108,$M$17),CONCATENATE(IF(J108=\"\",$M$12,\"\"),IF(AM108=J108,\"[b]\",\"\"),AM108,IF(AND(AM108<>\"\",AM108<>\"(Q)\"),VLOOKUP(AM108,$Q$11:$R$200,2,0),\"\"),IF(AM108=J108,\"[/b]\",\"\"),\"..... vs \",IF(AN108=J108,\"[b]\",\"\"),AN108,IF(AND(AN108<>\"\",AN108<>\"(Q)\"),VLOOKUP(AN108,$Q$11:$R$200,2,0),\"\"),IF(AN108=J108,\"[/b]\",\"\"),\"..... ( \",IF(AM108=J108,\"[b]\",\"\"),Коэффициенты!F108,IF(AM108=J108,\"[/b]\",\"\"),\" - \",IF(AN108=J108,\"[b]\",\"\"),Коэффициенты!G108,IF(AN108=J108,\"[/b]\",\"\"),\" )\",IF(J108=\"\",$M$13,\"\"))),\"\"),\"\")","v":""},null,null,null,null,null,null,null,null,null,null,{"$f":"IF(Коэффициенты!L108<>\"\",Коэффициенты!L108,\"\")","v":98},{"$f":"IF(Коэффициенты!M108<>\"\",Коэффициенты!M108,\"\")","v":""},null,null,null,null,null,null,null,null,null,null,null,null,null,null,null,null,null,null,null,null,null,{"$f":"IF(Коэффициенты!D108<>\"\",Коэффициенты!D108,\"\")","v":""},{"$f":"IF(Коэффициенты!E108<>\"\",Коэффициенты!E108,\"\")","v":""},""]
[null,{"$f":"IF(Коэффициенты!B109<>\"\",Коэффициенты!B109,\"\")","v":""},"",{"$f":"IF(Коэффициенты!C109<>\"\",Коэффициенты!C109,\"\")","v":""},{"$f":"IF(AND(AM109<>\"\",AN109<>\"\"),IF(OR(AM109<>\"\",AN109<>\"\"),IF(AN109=\"bye\",CONCATENATE($M$16,AM109,IF(AND(AM109<>\"\",AM109<>\"(Q)\"),VLOOKUP(AM109,$Q$11:$R$200,2,0),\"\"),\"..... vs \",AN109,$M$17),CONCATENATE(IF(J109=\"\",$M$12,\"\"),IF(AM109=J109,\"[b]\",\"\"),AM109,IF(AND(AM109<>\"\",AM109<>\"(Q)\"),VLOOKUP(AM109,$Q$11:$R$200,2,0),\"\"),IF(AM109=J109,\"[/b]\",\"\"),\"..... vs \",IF(AN109=J109,\"[b]\",\"\"),AN109,IF(AND(AN109<>\"\",AN109<>\"(Q)\"),VLOOKUP(AN109,$Q$11:$R$200,2,0),\"\"),IF(AN109=J109,\"[/b]\",\"\"),\"..... ( \",IF(AM109=J109,\"[b]\",\"\"),Коэффициенты!F109,IF(AM109=J109,\"[/b]\",\"\"),\" - \",IF(AN109=J109,\"[b]\",\"\"),Коэффициенты!G109,IF(AN109=J109,\"[/b]\",\"\"),\" )\",IF(J109=\"\",$M$13,\"\"))),\"\"),\"\")","v":""},null,null,null,null,null,null,null,null,null,null,{"$f":"IF(Коэффициенты!L109<>\"\",Коэффициенты!L109,\"\")","v":99},{"$f":"IF(Коэффициенты!M109<>\"\",Коэффициенты!M109,\"\")","v":""},null,null,null,null,null,null,null,null,null,null,null,null,null,null,null,null,null,null,null,null,null,{"$f":"IF(Коэффициенты!D109<>\"\",Коэффициенты!D109,\"\")","v":""},{"$f":"IF(Коэффициенты!E109<>\"\",Коэффициенты!E109,\"\")","v":""},""]
[null,{"$f":"IF(Коэффициенты!B110<>\"\",Коэффициенты!B110,\"\")","v":""},"",{"$f":"IF(Коэффициенты!C110<>\"\",Коэффициенты!C110,\"\")","v":""},{"$f":"IF(AND(AM110<>\"\",AN110<>\"\"),IF(OR(AM110<>\"\",AN110<>\"\"),IF(AN110=\"bye\",CONCATENATE($M$16,AM110,IF(AND(AM110<>\"\",AM110<>\"(Q)\"),VLOOKUP(AM110,$Q$11:$R$200,2,0),\"\"),\"..... vs \",AN110,$M$17),CONCATENATE(IF(J110=\"\",$M$12,\"\"),IF(AM110=J110,\"[b]\",\"\"),AM110,IF(AND(AM110<>\"\",AM110<>\"(Q)\"),VLOOKUP(AM110,$Q$11:$R$200,2,0),\"\"),IF(AM110=J110,\"[/b]\",\"\"),\"..... vs \",IF(AN110=J110,\"[b]\",\"\"),AN110,IF(AND(AN110<>\"\",AN110<>\"(Q)\"),VLOOKUP(AN110,$Q$11:$R$200,2,0),\"\"),IF(AN110=J110,\"[/b]\",\"\"),\"..... ( \",IF(AM110=J110,\"[b]\",\"\"),Коэффициенты!F110,IF(AM110=J110,\"[/b]\",\"\"),\" - \",IF(AN110=J110,\"[b]\",\"\"),Коэффициенты!G110,IF(AN110=J110,\"[/b]\",\"\"),\" )\",IF(J110=\"\",$M$13,\"\"))),\"\"),\"\")","v":""},null,null,null,null,null,null,null,null,null,null,{"$f":"IF(Коэффициенты!L110<>\"\",Коэффициенты!L110,\"\")","v":100},{"$f":"IF(Коэффициенты!M110<>\"\",Коэффициенты!M110,\"\")","v":""},null,null,null,null,null,null,null,null,null,null,null,null,null,null,null,null,null,null,null,null,null,{"$f":"IF(Коэффициенты!D110<>\"\",Коэффициенты!D110,\"\")","v":""},{"$f":"IF(Коэффициенты!E110<>\"\",Коэффициенты!E110,\"\")","v":""},""]
[null,{"$f":"IF(Коэффициенты!B111<>\"\",Коэффициенты!B111,\"\")","v":""},"",{"$f":"IF(Коэффициенты!C111<>\"\",Коэффициенты!C111,\"\")","v":""},{"$f":"IF(AND(AM111<>\"\",AN111<>\"\"),IF(OR(AM111<>\"\",AN111<>\"\"),IF(AN111=\"bye\",CONCATENATE($M$16,AM111,IF(AND(AM111<>\"\",AM111<>\"(Q)\"),VLOOKUP(AM111,$Q$11:$R$200,2,0),\"\"),\"..... vs \",AN111,$M$17),CONCATENATE(IF(J111=\"\",$M$12,\"\"),IF(AM111=J111,\"[b]\",\"\"),AM111,IF(AND(AM111<>\"\",AM111<>\"(Q)\"),VLOOKUP(AM111,$Q$11:$R$200,2,0),\"\"),IF(AM111=J111,\"[/b]\",\"\"),\"..... vs \",IF(AN111=J111,\"[b]\",\"\"),AN111,IF(AND(AN111<>\"\",AN111<>\"(Q)\"),VLOOKUP(AN111,$Q$11:$R$200,2,0),\"\"),IF(AN111=J111,\"[/b]\",\"\"),\"..... ( \",IF(AM111=J111,\"[b]\",\"\"),Коэффициенты!F111,IF(AM111=J111,\"[/b]\",\"\"),\" - \",IF(AN111=J111,\"[b]\",\"\"),Коэффициенты!G111,IF(AN111=J111,\"[/b]\",\"\"),\" )\",IF(J111=\"\",$M$13,\"\"))),\"\"),\"\")","v":""},null,null,null,null,null,null,null,null,null,null,{"$f":"IF(Коэффициенты!L111<>\"\",Коэффициенты!L111,\"\")","v":101},{"$f":"IF(Коэффициенты!M111<>\"\",Коэффициенты!M111,\"\")","v":""},null,null,null,null,null,null,null,null,null,null,null,null,null,null,null,null,null,null,null,null,null,{"$f":"IF(Коэффициенты!D111<>\"\",Коэффициенты!D111,\"\")","v":""},{"$f":"IF(Коэффициенты!E111<>\"\",Коэффициенты!E111,\"\")","v":""},""]
[null,{"$f":"IF(Коэффициенты!B112<>\"\",Коэффициенты!B112,\"\")","v":""},"",{"$f":"IF(Коэффициенты!C112<>\"\",Коэффициенты!C112,\"\")","v":""},{"$f":"IF(AND(AM112<>\"\",AN112<>\"\"),IF(OR(AM112<>\"\",AN112<>\"\"),IF(AN112=\"bye\",CONCATENATE($M$16,AM112,IF(AND(AM112<>\"\",AM112<>\"(Q)\"),VLOOKUP(AM112,$Q$11:$R$200,2,0),\"\"),\"..... vs \",AN112,$M$17),CONCATENATE(IF(J112=\"\",$M$12,\"\"),IF(AM112=J112,\"[b]\",\"\"),AM112,IF(AND(AM112<>\"\",AM112<>\"(Q)\"),VLOOKUP(AM112,$Q$11:$R$200,2,0),\"\"),IF(AM112=J112,\"[/b]\",\"\"),\"..... vs \",IF(AN112=J112,\"[b]\",\"\"),AN112,IF(AND(AN112<>\"\",AN112<>\"(Q)\"),VLOOKUP(AN112,$Q$11:$R$200,2,0),\"\"),IF(AN112=J112,\"[/b]\",\"\"),\"..... ( \",IF(AM112=J112,\"[b]\",\"\"),Коэффициенты!F112,IF(AM112=J112,\"[/b]\",\"\"),\" - \",IF(AN112=J112,\"[b]\",\"\"),Коэффициенты!G112,IF(AN112=J112,\"[/b]\",\"\"),\" )\",IF(J112=\"\",$M$13,\"\"))),\"\"),\"\")","v":""},null,null,null,null,null,null,null,null,null,null,{"$f":"IF(Коэффициенты!L112<>\"\",Коэффициенты!L112,\"\")","v":102},{"$f":"IF(Коэффициенты!M112<>\"\",Коэффициенты!M112,\"\")","v":""},null,null,null,null,null,null,null,null,null,null,null,null,null,null,null,null,null,null,null,null,null,{"$f":"IF(Коэффициенты!D112<>\"\",Коэффициенты!D112,\"\")","v":""},{"$f":"IF(Коэффициенты!E112<>\"\",Коэффициенты!E112,\"\")","v":""},""]
[null,{"$f":"IF(Коэффициенты!B113<>\"\",Коэффициенты!B113,\"\")","v":""},"",{"$f":"IF(Коэффициенты!C113<>\"\",Коэффициенты!C113,\"\")","v":""},{"$f":"IF(AND(AM113<>\"\",AN113<>\"\"),IF(OR(AM113<>\"\",AN113<>\"\"),IF(AN113=\"bye\",CONCATENATE($M$16,AM113,IF(AND(AM113<>\"\",AM113<>\"(Q)\"),VLOOKUP(AM113,$Q$11:$R$200,2,0),\"\"),\"..... vs \",AN113,$M$17),CONCATENATE(IF(J113=\"\",$M$12,\"\"),IF(AM113=J113,\"[b]\",\"\"),AM113,IF(AND(AM113<>\"\",AM113<>\"(Q)\"),VLOOKUP(AM113,$Q$11:$R$200,2,0),\"\"),IF(AM113=J113,\"[/b]\",\"\"),\"..... vs \",IF(AN113=J113,\"[b]\",\"\"),AN113,IF(AND(AN113<>\"\",AN113<>\"(Q)\"),VLOOKUP(AN113,$Q$11:$R$200,2,0),\"\"),IF(AN113=J113,\"[/b]\",\"\"),\"..... ( \",IF(AM113=J113,\"[b]\",\"\"),Коэффициенты!F113,IF(AM113=J113,\"[/b]\",\"\"),\" - \",IF(AN113=J113,\"[b]\",\"\"),Коэффициенты!G113,IF(AN113=J113,\"[/b]\",\"\"),\" )\",IF(J113=\"\",$M$13,\"\"))),\"\"),\"\")","v":""},null,null,null,null,null,null,null,null,null,null,{"$f":"IF(Коэффициенты!L113<>\"\",Коэффициенты!L113,\"\")","v":103},{"$f":"IF(Коэффициенты!M113<>\"\",Коэффициенты!M113,\"\")","v":""},null,null,null,null,null,null,null,null,null,null,null,null,null,null,null,null,null,null,null,null,null,{"$f":"IF(Коэффициенты!D113<>\"\",Коэффициенты!D113,\"\")","v":""},{"$f":"IF(Коэффициенты!E113<>\"\",Коэффициенты!E113,\"\")","v":""},""]
[null,{"$f":"IF(Коэффициенты!B114<>\"\",Коэффициенты!B114,\"\")","v":""},"",{"$f":"IF(Коэффициенты!C114<>\"\",Коэффициенты!C114,\"\")","v":""},{"$f":"IF(AND(AM114<>\"\",AN114<>\"\"),IF(OR(AM114<>\"\",AN114<>\"\"),IF(AN114=\"bye\",CONCATENATE($M$16,AM114,IF(AND(AM114<>\"\",AM114<>\"(Q)\"),VLOOKUP(AM114,$Q$11:$R$200,2,0),\"\"),\"..... vs \",AN114,$M$17),CONCATENATE(IF(J114=\"\",$M$12,\"\"),IF(AM114=J114,\"[b]\",\"\"),AM114,IF(AND(AM114<>\"\",AM114<>\"(Q)\"),VLOOKUP(AM114,$Q$11:$R$200,2,0),\"\"),IF(AM114=J114,\"[/b]\",\"\"),\"..... vs \",IF(AN114=J114,\"[b]\",\"\"),AN114,IF(AND(AN114<>\"\",AN114<>\"(Q)\"),VLOOKUP(AN114,$Q$11:$R$200,2,0),\"\"),IF(AN114=J114,\"[/b]\",\"\"),\"..... ( \",IF(AM114=J114,\"[b]\",\"\"),Коэффициенты!F114,IF(AM114=J114,\"[/b]\",\"\"),\" - \",IF(AN114=J114,\"[b]\",\"\"),Коэффициенты!G114,IF(AN114=J114,\"[/b]\",\"\"),\" )\",IF(J114=\"\",$M$13,\"\"))),\"\"),\"\")","v":""},null,null,null,null,null,null,null,null,null,null,{"$f":"IF(Коэффициенты!L114<>\"\",Коэффициенты!L114,\"\")","v":104},{"$f":"IF(Коэффициенты!M114<>\"\",Коэффициенты!M114,\"\")","v":""},null,null,null,null,null,null,null,null,null,null,null,null,null,null,null,null,null,null,null,null,null,{"$f":"IF(Коэффициенты!D114<>\"\",Коэффициенты!D114,\"\")","v":""},{"$f":"IF(Коэффициенты!E114<>\"\",Коэффициенты!E114,\"\")","v":""},""]
[null,{"$f":"IF(Коэффициенты!B115<>\"\",Коэффициенты!B115,\"\")","v":""},"",{"$f":"IF(Коэффициенты!C115<>\"\",Коэффициенты!C115,\"\")","v":""},{"$f":"IF(AND(AM115<>\"\",AN115<>\"\"),IF(OR(AM115<>\"\",AN115<>\"\"),IF(AN115=\"bye\",CONCATENATE($M$16,AM115,IF(AND(AM115<>\"\",AM115<>\"(Q)\"),VLOOKUP(AM115,$Q$11:$R$200,2,0),\"\"),\"..... vs \",AN115,$M$17),CONCATENATE(IF(J115=\"\",$M$12,\"\"),IF(AM115=J115,\"[b]\",\"\"),AM115,IF(AND(AM115<>\"\",AM115<>\"(Q)\"),VLOOKUP(AM115,$Q$11:$R$200,2,0),\"\"),IF(AM115=J115,\"[/b]\",\"\"),\"..... vs \",IF(AN115=J115,\"[b]\",\"\"),AN115,IF(AND(AN115<>\"\",AN115<>\"(Q)\"),VLOOKUP(AN115,$Q$11:$R$200,2,0),\"\"),IF(AN115=J115,\"[/b]\",\"\"),\"..... ( \",IF(AM115=J115,\"[b]\",\"\"),Коэффициенты!F115,IF(AM115=J115,\"[/b]\",\"\"),\" - \",IF(AN115=J115,\"[b]\",\"\"),Коэффициенты!G115,IF(AN115=J115,\"[/b]\",\"\"),\" )\",IF(J115=\"\",$M$13,\"\"))),\"\"),\"\")","v":""},null,null,null,null,null,null,null,null,null,null,{"$f":"IF(Коэффициенты!L115<>\"\",Коэффициенты!L115,\"\")","v":105},{"$f":"IF(Коэффициенты!M115<>\"\",Коэффициенты!M115,\"\")","v":""},null,null,null,null,null,null,null,null,null,null,null,null,null,null,null,null,null,null,null,null,null,{"$f":"IF(Коэффициенты!D115<>\"\",Коэффициенты!D115,\"\")","v":""},{"$f":"IF(Коэффициенты!E115<>\"\",Коэффициенты!E115,\"\")","v":""},""]
[null,{"$f":"IF(Коэффициенты!B116<>\"\",Коэффициенты!B116,\"\")","v":""},"",{"$f":"IF(Коэффициенты!C116<>\"\",Коэффициенты!C116,\"\")","v":""},{"$f":"IF(AND(AM116<>\"\",AN116<>\"\"),IF(OR(AM116<>\"\",AN116<>\"\"),IF(AN116=\"bye\",CONCATENATE($M$16,AM116,IF(AND(AM116<>\"\",AM116<>\"(Q)\"),VLOOKUP(AM116,$Q$11:$R$200,2,0),\"\"),\"..... vs \",AN116,$M$17),CONCATENATE(IF(J116=\"\",$M$12,\"\"),IF(AM116=J116,\"[b]\",\"\"),AM116,IF(AND(AM116<>\"\",AM116<>\"(Q)\"),VLOOKUP(AM116,$Q$11:$R$200,2,0),\"\"),IF(AM116=J116,\"[/b]\",\"\"),\"..... vs \",IF(AN116=J116,\"[b]\",\"\"),AN116,IF(AND(AN116<>\"\",AN116<>\"(Q)\"),VLOOKUP(AN116,$Q$11:$R$200,2,0),\"\"),IF(AN116=J116,\"[/b]\",\"\"),\"..... ( \",IF(AM116=J116,\"[b]\",\"\"),Коэффициенты!F116,IF(AM116=J116,\"[/b]\",\"\"),\" - \",IF(AN116=J116,\"[b]\",\"\"),Коэффициенты!G116,IF(AN116=J116,\"[/b]\",\"\"),\" )\",IF(J116=\"\",$M$13,\"\"))),\"\"),\"\")","v":""},null,null,null,null,null,null,null,null,null,null,{"$f":"IF(Коэффициенты!L116<>\"\",Коэффициенты!L116,\"\")","v":106},{"$f":"IF(Коэффициенты!M116<>\"\",Коэффициенты!M116,\"\")","v":""},"(Q)",null,null,null,null,null,null,null,null,null,null,null,null,null,null,null,null,null,null,null,null,{"$f":"IF(Коэффициенты!D116<>\"\",Коэффициенты!D116,\"\")","v":""},{"$f":"IF(Коэффициенты!E116<>\"\",Коэффициенты!E116,\"\")","v":""},""]
[null,{"$f":"IF(Коэффициенты!B117<>\"\",Коэффициенты!B117,\"\")","v":""},"",{"$f":"IF(Коэффициенты!C117<>\"\",Коэффициенты!C117,\"\")","v":""},{"$f":"IF(AND(AM117<>\"\",AN117<>\"\"),IF(OR(AM117<>\"\",AN117<>\"\"),IF(AN117=\"bye\",CONCATENATE($M$16,AM117,IF(AND(AM117<>\"\",AM117<>\"(Q)\"),VLOOKUP(AM117,$Q$11:$R$200,2,0),\"\"),\"..... vs \",AN117,$M$17),CONCATENATE(IF(J117=\"\",$M$12,\"\"),IF(AM117=J117,\"[b]\",\"\"),AM117,IF(AND(AM117<>\"\",AM117<>\"(Q)\"),VLOOKUP(AM117,$Q$11:$R$200,2,0),\"\"),IF(AM117=J117,\"[/b]\",\"\"),\"..... vs \",IF(AN117=J117,\"[b]\",\"\"),AN117,IF(AND(AN117<>\"\",AN117<>\"(Q)\"),VLOOKUP(AN117,$Q$11:$R$200,2,0),\"\"),IF(AN117=J117,\"[/b]\",\"\"),\"..... ( \",IF(AM117=J117,\"[b]\",\"\"),Коэффициенты!F117,IF(AM117=J117,\"[/b]\",\"\"),\" - \",IF(AN117=J117,\"[b]\",\"\"),Коэффициенты!G117,IF(AN117=J117,\"[/b]\",\"\"),\" )\",IF(J117=\"\",$M$13,\"\"))),\"\"),\"\")","v":""},null,null,null,null,null,null,null,null,null,null,{"$f":"IF(Коэффициенты!L117<>\"\",Коэффициенты!L117,\"\")","v":107},{"$f":"IF(Коэффициенты!M117<>\"\",Коэффициенты!M117,\"\")","v":""},null,null,null,null,null,null,null,null,null,null,null,null,null,null,null,null,null,null,null,null,null,{"$f":"IF(Коэффициенты!D117<>\"\",Коэффициенты!D117,\"\")","v":""},{"$f":"IF(Коэффициенты!E117<>\"\",Коэффициенты!E117,\"\")","v":""},""]
[null,{"$f":"IF(Коэффициенты!B118<>\"\",Коэффициенты!B118,\"\")","v":""},"",{"$f":"IF(Коэффициенты!C118<>\"\",Коэффициенты!C118,\"\")","v":""},{"$f":"IF(AND(AM118<>\"\",AN118<>\"\"),IF(OR(AM118<>\"\",AN118<>\"\"),IF(AN118=\"bye\",CONCATENATE($M$16,AM118,IF(AND(AM118<>\"\",AM118<>\"(Q)\"),VLOOKUP(AM118,$Q$11:$R$200,2,0),\"\"),\"..... vs \",AN118,$M$17),CONCATENATE(IF(J118=\"\",$M$12,\"\"),IF(AM118=J118,\"[b]\",\"\"),AM118,IF(AND(AM118<>\"\",AM118<>\"(Q)\"),VLOOKUP(AM118,$Q$11:$R$200,2,0),\"\"),IF(AM118=J118,\"[/b]\",\"\"),\"..... vs \",IF(AN118=J118,\"[b]\",\"\"),AN118,IF(AND(AN118<>\"\",AN118<>\"(Q)\"),VLOOKUP(AN118,$Q$11:$R$200,2,0),\"\"),IF(AN118=J118,\"[/b]\",\"\"),\"..... ( \",IF(AM118=J118,\"[b]\",\"\"),Коэффициенты!F118,IF(AM118=J118,\"[/b]\",\"\"),\" - \",IF(AN118=J118,\"[b]\",\"\"),Коэффициенты!G118,IF(AN118=J118,\"[/b]\",\"\"),\" )\",IF(J118=\"\",$M$13,\"\"))),\"\"),\"\")","v":""},null,null,null,null,null,null,null,null,null,null,{"$f":"IF(Коэффициенты!L118<>\"\",Коэффициенты!L118,\"\")","v":108},{"$f":"IF(Коэффициенты!M118<>\"\",Коэффициенты!M118,\"\")","v":""},"(Q)",null,null,null,null,null,null,null,null,null,null,null,null,null,null,null,null,null,null,null,null,{"$f":"IF(Коэффициенты!D118<>\"\",Коэффициенты!D118,\"\")","v":""},{"$f":"IF(Коэффициенты!E118<>\"\",Коэффициенты!E118,\"\")","v":""},""]
[null,{"$f":"IF(Коэффициенты!B119<>\"\",Коэффициенты!B119,\"\")","v":""},"",{"$f":"IF(Коэффициенты!C119<>\"\",Коэффициенты!C119,\"\")","v":""},{"$f":"IF(AND(AM119<>\"\",AN119<>\"\"),IF(OR(AM119<>\"\",AN119<>\"\"),IF(AN119=\"bye\",CONCATENATE($M$16,AM119,IF(AND(AM119<>\"\",AM119<>\"(Q)\"),VLOOKUP(AM119,$Q$11:$R$200,2,0),\"\"),\"..... vs \",AN119,$M$17),CONCATENATE(IF(J119=\"\",$M$12,\"\"),IF(AM119=J119,\"[b]\",\"\"),AM119,IF(AND(AM119<>\"\",AM119<>\"(Q)\"),VLOOKUP(AM119,$Q$11:$R$200,2,0),\"\"),IF(AM119=J119,\"[/b]\",\"\"),\"..... vs \",IF(AN119=J119,\"[b]\",\"\"),AN119,IF(AND(AN119<>\"\",AN119<>\"(Q)\"),VLOOKUP(AN119,$Q$11:$R$200,2,0),\"\"),IF(AN119=J119,\"[/b]\",\"\"),\"..... ( \",IF(AM119=J119,\"[b]\",\"\"),Коэффициенты!F119,IF(AM119=J119,\"[/b]\",\"\"),\" - \",IF(AN119=J119,\"[b]\",\"\"),Коэффициенты!G119,IF(AN119=J119,\"[/b]\",\"\"),\" )\",IF(J119=\"\",$M$13,\"\"))),\"\"),\"\")","v":""},null,null,null,null,null,null,null,null,null,null,{"$f":"IF(Коэффициенты!L119<>\"\",Коэффициенты!L119,\"\")","v":109},{"$f":"IF(Коэффициенты!M119<>\"\",Коэффициенты!M119,\"\")","v":""},null,null,null,null,null,null,null,null,null,null,null,null,null,null,null,null,null,null,null,null,null,{"$f":"IF(Коэффициенты!D119<>\"\",Коэффициенты!D119,\"\")","v":""},{"$f":"IF(Коэффициенты!E119<>\"\",Коэффициенты!E119,\"\")","v":""},""]
[null,{"$f":"IF(Коэффициенты!B120<>\"\",Коэффициенты!B120,\"\")","v":""},"",{"$f":"IF(Коэффициенты!C120<>\"\",Коэффициенты!C120,\"\")","v":""},{"$f":"IF(AND(AM120<>\"\",AN120<>\"\"),IF(OR(AM120<>\"\",AN120<>\"\"),IF(AN120=\"bye\",CONCATENATE($M$16,AM120,IF(AND(AM120<>\"\",AM120<>\"(Q)\"),VLOOKUP(AM120,$Q$11:$R$200,2,0),\"\"),\"..... vs \",AN120,$M$17),CONCATENATE(IF(J120=\"\",$M$12,\"\"),IF(AM120=J120,\"[b]\",\"\"),AM120,IF(AND(AM120<>\"\",AM120<>\"(Q)\"),VLOOKUP(AM120,$Q$11:$R$200,2,0),\"\"),IF(AM120=J120,\"[/b]\",\"\"),\"..... vs \",IF(AN120=J120,\"[b]\",\"\"),AN120,IF(AND(AN120<>\"\",AN120<>\"(Q)\"),VLOOKUP(AN120,$Q$11:$R$200,2,0),\"\"),IF(AN120=J120,\"[/b]\",\"\"),\"..... ( \",IF(AM120=J120,\"[b]\",\"\"),Коэффициенты!F120,IF(AM120=J120,\"[/b]\",\"\"),\" - \",IF(AN120=J120,\"[b]\",\"\"),Коэффициенты!G120,IF(AN120=J120,\"[/b]\",\"\"),\" )\",IF(J120=\"\",$M$13,\"\"))),\"\"),\"\")","v":""},null,null,null,null,null,null,null,null,null,null,{"$f":"IF(Коэффициенты!L120<>\"\",Коэффициенты!L120,\"\")","v":110},{"$f":"IF(Коэффициенты!M120<>\"\",Коэффициенты!M120,\"\")","v":""},"(WC)",null,null,null,null,null,null,null,null,null,null,null,null,null,null,null,null,null,null,null,null,{"$f":"IF(Коэффициенты!D120<>\"\",Коэффициенты!D120,\"\")","v":""},{"$f":"IF(Коэффициенты!E120<>\"\",Коэффициенты!E120,\"\")","v":""},""]
[null,{"$f":"IF(Коэффициенты!B121<>\"\",Коэффициенты!B121,\"\")","v":""},"",{"$f":"IF(Коэффициенты!C121<>\"\",Коэффициенты!C121,\"\")","v":""},{"$f":"IF(AND(AM121<>\"\",AN121<>\"\"),IF(OR(AM121<>\"\",AN121<>\"\"),IF(AN121=\"bye\",CONCATENATE($M$16,AM121,IF(AND(AM121<>\"\",AM121<>\"(Q)\"),VLOOKUP(AM121,$Q$11:$R$200,2,0),\"\"),\"..... vs \",AN121,$M$17),CONCATENATE(IF(J121=\"\",$M$12,\"\"),IF(AM121=J121,\"[b]\",\"\"),AM121,IF(AND(AM121<>\"\",AM121<>\"(Q)\"),VLOOKUP(AM121,$Q$11:$R$200,2,0),\"\"),IF(AM121=J121,\"[/b]\",\"\"),\"..... vs \",IF(AN121=J121,\"[b]\",\"\"),AN121,IF(AND(AN121<>\"\",AN121<>\"(Q)\"),VLOOKUP(AN121,$Q$11:$R$200,2,0),\"\"),IF(AN121=J121,\"[/b]\",\"\"),\"..... ( \",IF(AM121=J121,\"[b]\",\"\"),Коэффициенты!F121,IF(AM121=J121,\"[/b]\",\"\"),\" - \",IF(AN121=J121,\"[b]\",\"\"),Коэффициенты!G121,IF(AN121=J121,\"[/b]\",\"\"),\" )\",IF(J121=\"\",$M$13,\"\"))),\"\"),\"\")","v":""},null,null,null,null,null,null,null,null,null,null,{"$f":"IF(Коэффициенты!L121<>\"\",Коэффициенты!L121,\"\")","v":111},{"$f":"IF(Коэффициенты!M121<>\"\",Коэффициенты!M121,\"\")","v":""},null,null,null,null,null,null,null,null,null,null,null,null,null,null,null,null,null,null,null,null,null,{"$f":"IF(Коэффициенты!D121<>\"\",Коэффициенты!D121,\"\")","v":""},{"$f":"IF(Коэффициенты!E121<>\"\",Коэффициенты!E121,\"\")","v":""},""]
[null,{"$f":"IF(Коэффициенты!B122<>\"\",Коэффициенты!B122,\"\")","v":""},"",{"$f":"IF(Коэффициенты!C122<>\"\",Коэффициенты!C122,\"\")","v":""},{"$f":"IF(AND(AM122<>\"\",AN122<>\"\"),IF(OR(AM122<>\"\",AN122<>\"\"),IF(AN122=\"bye\",CONCATENATE($M$16,AM122,IF(AND(AM122<>\"\",AM122<>\"(Q)\"),VLOOKUP(AM122,$Q$11:$R$200,2,0),\"\"),\"..... vs \",AN122,$M$17),CONCATENATE(IF(J122=\"\",$M$12,\"\"),IF(AM122=J122,\"[b]\",\"\"),AM122,IF(AND(AM122<>\"\",AM122<>\"(Q)\"),VLOOKUP(AM122,$Q$11:$R$200,2,0),\"\"),IF(AM122=J122,\"[/b]\",\"\"),\"..... vs \",IF(AN122=J122,\"[b]\",\"\"),AN122,IF(AND(AN122<>\"\",AN122<>\"(Q)\"),VLOOKUP(AN122,$Q$11:$R$200,2,0),\"\"),IF(AN122=J122,\"[/b]\",\"\"),\"..... ( \",IF(AM122=J122,\"[b]\",\"\"),Коэффициенты!F122,IF(AM122=J122,\"[/b]\",\"\"),\" - \",IF(AN122=J122,\"[b]\",\"\"),Коэффициенты!G122,IF(AN122=J122,\"[/b]\",\"\"),\" )\",IF(J122=\"\",$M$13,\"\"))),\"\"),\"\")","v":""},null,null,null,null,null,null,null,null,null,null,{"$f":"IF(Коэффициенты!L122<>\"\",Коэффициенты!L122,\"\")","v":112},{"$f":"IF(Коэффициенты!M122<>\"\",Коэффициенты!M122,\"\")","v":""},null,null,null,null,null,null,null,null,null,null,null,null,null,null,null,null,null,null,null,null,null,{"$f":"IF(Коэффициенты!D122<>\"\",Коэффициенты!D122,\"\")","v":""},{"$f":"IF(Коэффициенты!E122<>\"\",Коэффициенты!E122,\"\")","v":""},""]
[null,{"$f":"IF(Коэффициенты!B123<>\"\",Коэффициенты!B123,\"\")","v":""},"",{"$f":"IF(Коэффициенты!C123<>\"\",Коэффициенты!C123,\"\")","v":""},{"$f":"IF(AND(AM123<>\"\",AN123<>\"\"),IF(OR(AM123<>\"\",AN123<>\"\"),IF(AN123=\"bye\",CONCATENATE($M$16,AM123,IF(AND(AM123<>\"\",AM123<>\"(Q)\"),VLOOKUP(AM123,$Q$11:$R$200,2,0),\"\"),\"..... vs \",AN123,$M$17),CONCATENATE(IF(J123=\"\",$M$12,\"\"),IF(AM123=J123,\"[b]\",\"\"),AM123,IF(AND(AM123<>\"\",AM123<>\"(Q)\"),VLOOKUP(AM123,$Q$11:$R$200,2,0),\"\"),IF(AM123=J123,\"[/b]\",\"\"),\"..... vs \",IF(AN123=J123,\"[b]\",\"\"),AN123,IF(AND(AN123<>\"\",AN123<>\"(Q)\"),VLOOKUP(AN123,$Q$11:$R$200,2,0),\"\"),IF(AN123=J123,\"[/b]\",\"\"),\"..... ( \",IF(AM123=J123,\"[b]\",\"\"),Коэффициенты!F123,IF(AM123=J123,\"[/b]\",\"\"),\" - \",IF(AN123=J123,\"[b]\",\"\"),Коэффициенты!G123,IF(AN123=J123,\"[/b]\",\"\"),\" )\",IF(J123=\"\",$M$13,\"\"))),\"\"),\"\")","v":""},null,null,null,null,null,null,null,null,null,null,{"$f":"IF(Коэффициенты!L123<>\"\",Коэффициенты!L123,\"\")","v":113},{"$f":"IF(Коэффициенты!M123<>\"\",Коэффициенты!M123,\"\")","v":""},null,null,null,null,null,null,null,null,null,null,null,null,null,null,null,null,null,null,null,null,null,{"$f":"IF(Коэффициенты!D123<>\"\",Коэффициенты!D123,\"\")","v":""},{"$f":"IF(Коэффициенты!E123<>\"\",Коэффициенты!E123,\"\")","v":""},""]
[null,{"$f":"IF(Коэффициенты!B124<>\"\",Коэффициенты!B124,\"\")","v":""},"",{"$f":"IF(Коэффициенты!C124<>\"\",Коэффициенты!C124,\"\")","v":""},{"$f":"IF(AND(AM124<>\"\",AN124<>\"\"),IF(OR(AM124<>\"\",AN124<>\"\"),IF(AN124=\"bye\",CONCATENATE($M$16,AM124,IF(AND(AM124<>\"\",AM124<>\"(Q)\"),VLOOKUP(AM124,$Q$11:$R$200,2,0),\"\"),\"..... vs \",AN124,$M$17),CONCATENATE(IF(J124=\"\",$M$12,\"\"),IF(AM124=J124,\"[b]\",\"\"),AM124,IF(AND(AM124<>\"\",AM124<>\"(Q)\"),VLOOKUP(AM124,$Q$11:$R$200,2,0),\"\"),IF(AM124=J124,\"[/b]\",\"\"),\"..... vs \",IF(AN124=J124,\"[b]\",\"\"),AN124,IF(AND(AN124<>\"\",AN124<>\"(Q)\"),VLOOKUP(AN124,$Q$11:$R$200,2,0),\"\"),IF(AN124=J124,\"[/b]\",\"\"),\"..... ( \",IF(AM124=J124,\"[b]\",\"\"),Коэффициенты!F124,IF(AM124=J124,\"[/b]\",\"\"),\" - \",IF(AN124=J124,\"[b]\",\"\"),Коэффициенты!G124,IF(AN124=J124,\"[/b]\",\"\"),\" )\",IF(J124=\"\",$M$13,\"\"))),\"\"),\"\")","v":""},null,null,null,null,null,null,null,null,null,null,{"$f":"IF(Коэффициенты!L124<>\"\",Коэффициенты!L124,\"\")","v":114},{"$f":"IF(Коэффициенты!M124<>\"\",Коэффициенты!M124,\"\")","v":""},null,null,null,null,null,null,null,null,null,null,null,null,null,null,null,null,null,null,null,null,null,{"$f":"IF(Коэффициенты!D124<>\"\",Коэффициенты!D124,\"\")","v":""},{"$f":"IF(Коэффициенты!E124<>\"\",Коэффициенты!E124,\"\")","v":""},""]
[null,{"$f":"IF(Коэффициенты!B125<>\"\",Коэффициенты!B125,\"\")","v":""},"",{"$f":"IF(Коэффициенты!C125<>\"\",Коэффициенты!C125,\"\")","v":""},{"$f":"IF(AND(AM125<>\"\",AN125<>\"\"),IF(OR(AM125<>\"\",AN125<>\"\"),IF(AN125=\"bye\",CONCATENATE($M$16,AM125,IF(AND(AM125<>\"\",AM125<>\"(Q)\"),VLOOKUP(AM125,$Q$11:$R$200,2,0),\"\"),\"..... vs \",AN125,$M$17),CONCATENATE(IF(J125=\"\",$M$12,\"\"),IF(AM125=J125,\"[b]\",\"\"),AM125,IF(AND(AM125<>\"\",AM125<>\"(Q)\"),VLOOKUP(AM125,$Q$11:$R$200,2,0),\"\"),IF(AM125=J125,\"[/b]\",\"\"),\"..... vs \",IF(AN125=J125,\"[b]\",\"\"),AN125,IF(AND(AN125<>\"\",AN125<>\"(Q)\"),VLOOKUP(AN125,$Q$11:$R$200,2,0),\"\"),IF(AN125=J125,\"[/b]\",\"\"),\"..... ( \",IF(AM125=J125,\"[b]\",\"\"),Коэффициенты!F125,IF(AM125=J125,\"[/b]\",\"\"),\" - \",IF(AN125=J125,\"[b]\",\"\"),Коэффициенты!G125,IF(AN125=J125,\"[/b]\",\"\"),\" )\",IF(J125=\"\",$M$13,\"\"))),\"\"),\"\")","v":""},null,null,null,null,null,null,null,null,null,null,{"$f":"IF(Коэффициенты!L125<>\"\",Коэффициенты!L125,\"\")","v":115},{"$f":"IF(Коэффициенты!M125<>\"\",Коэффициенты!M125,\"\")","v":""},null,null,null,null,null,null,null,null,null,null,null,null,null,null,null,null,null,null,null,null,null,{"$f":"IF(Коэффициенты!D125<>\"\",Коэффициенты!D125,\"\")","v":""},{"$f":"IF(Коэффициенты!E125<>\"\",Коэффициенты!E125,\"\")","v":""},""]
[null,{"$f":"IF(Коэффициенты!B126<>\"\",Коэффициенты!B126,\"\")","v":""},"",{"$f":"IF(Коэффициенты!C126<>\"\",Коэффициенты!C126,\"\")","v":""},{"$f":"IF(AND(AM126<>\"\",AN126<>\"\"),IF(OR(AM126<>\"\",AN126<>\"\"),IF(AN126=\"bye\",CONCATENATE($M$16,AM126,IF(AND(AM126<>\"\",AM126<>\"(Q)\"),VLOOKUP(AM126,$Q$11:$R$200,2,0),\"\"),\"..... vs \",AN126,$M$17),CONCATENATE(IF(J126=\"\",$M$12,\"\"),IF(AM126=J126,\"[b]\",\"\"),AM126,IF(AND(AM126<>\"\",AM126<>\"(Q)\"),VLOOKUP(AM126,$Q$11:$R$200,2,0),\"\"),IF(AM126=J126,\"[/b]\",\"\"),\"..... vs \",IF(AN126=J126,\"[b]\",\"\"),AN126,IF(AND(AN126<>\"\",AN126<>\"(Q)\"),VLOOKUP(AN126,$Q$11:$R$200,2,0),\"\"),IF(AN126=J126,\"[/b]\",\"\"),\"..... ( \",IF(AM126=J126,\"[b]\",\"\"),Коэффициенты!F126,IF(AM126=J126,\"[/b]\",\"\"),\" - \",IF(AN126=J126,\"[b]\",\"\"),Коэффициенты!G126,IF(AN126=J126,\"[/b]\",\"\"),\" )\",IF(J126=\"\",$M$13,\"\"))),\"\"),\"\")","v":""},null,null,null,null,null,null,null,null,null,null,{"$f":"IF(Коэффициенты!L126<>\"\",Коэффициенты!L126,\"\")","v":116},{"$f":"IF(Коэффициенты!M126<>\"\",Коэффициенты!M126,\"\")","v":""},"(WC)",null,null,null,null,null,null,null,null,null,null,null,null,null,null,null,null,null,null,null,null,{"$f":"IF(Коэффициенты!D126<>\"\",Коэффициенты!D126,\"\")","v":""},{"$f":"IF(Коэффициенты!E126<>\"\",Коэффициенты!E126,\"\")","v":""},""]
[null,{"$f":"IF(Коэффициенты!B127<>\"\",Коэффициенты!B127,\"\")","v":""},"",{"$f":"IF(Коэффициенты!C127<>\"\",Коэффициенты!C127,\"\")","v":""},{"$f":"IF(AND(AM127<>\"\",AN127<>\"\"),IF(OR(AM127<>\"\",AN127<>\"\"),IF(AN127=\"bye\",CONCATENATE($M$16,AM127,IF(AND(AM127<>\"\",AM127<>\"(Q)\"),VLOOKUP(AM127,$Q$11:$R$200,2,0),\"\"),\"..... vs \",AN127,$M$17),CONCATENATE(IF(J127=\"\",$M$12,\"\"),IF(AM127=J127,\"[b]\",\"\"),AM127,IF(AND(AM127<>\"\",AM127<>\"(Q)\"),VLOOKUP(AM127,$Q$11:$R$200,2,0),\"\"),IF(AM127=J127,\"[/b]\",\"\"),\"..... vs \",IF(AN127=J127,\"[b]\",\"\"),AN127,IF(AND(AN127<>\"\",AN127<>\"(Q)\"),VLOOKUP(AN127,$Q$11:$R$200,2,0),\"\"),IF(AN127=J127,\"[/b]\",\"\"),\"..... ( \",IF(AM127=J127,\"[b]\",\"\"),Коэффициенты!F127,IF(AM127=J127,\"[/b]\",\"\"),\" - \",IF(AN127=J127,\"[b]\",\"\"),Коэффициенты!G127,IF(AN127=J127,\"[/b]\",\"\"),\" )\",IF(J127=\"\",$M$13,\"\"))),\"\"),\"\")","v":""},null,null,null,null,null,null,null,null,null,null,{"$f":"IF(Коэффициенты!L127<>\"\",Коэффициенты!L127,\"\")","v":117},{"$f":"IF(Коэффициенты!M127<>\"\",Коэффициенты!M127,\"\")","v":""},null,null,null,null,null,null,null,null,null,null,null,null,null,null,null,null,null,null,null,null,null,{"$f":"IF(Коэффициенты!D127<>\"\",Коэффициенты!D127,\"\")","v":""},{"$f":"IF(Коэффициенты!E127<>\"\",Коэффициенты!E127,\"\")","v":""},""]
[null,{"$f":"IF(Коэффициенты!B128<>\"\",Коэффициенты!B128,\"\")","v":""},"",{"$f":"IF(Коэффициенты!C128<>\"\",Коэффициенты!C128,\"\")","v":""},{"$f":"IF(AND(AM128<>\"\",AN128<>\"\"),IF(OR(AM128<>\"\",AN128<>\"\"),IF(AN128=\"bye\",CONCATENATE($M$16,AM128,IF(AND(AM128<>\"\",AM128<>\"(Q)\"),VLOOKUP(AM128,$Q$11:$R$200,2,0),\"\"),\"..... vs \",AN128,$M$17),CONCATENATE(IF(J128=\"\",$M$12,\"\"),IF(AM128=J128,\"[b]\",\"\"),AM128,IF(AND(AM128<>\"\",AM128<>\"(Q)\"),VLOOKUP(AM128,$Q$11:$R$200,2,0),\"\"),IF(AM128=J128,\"[/b]\",\"\"),\"..... vs \",IF(AN128=J128,\"[b]\",\"\"),AN128,IF(AND(AN128<>\"\",AN128<>\"(Q)\"),VLOOKUP(AN128,$Q$11:$R$200,2,0),\"\"),IF(AN128=J128,\"[/b]\",\"\"),\"..... ( \",IF(AM128=J128,\"[b]\",\"\"),Коэффициенты!F128,IF(AM128=J128,\"[/b]\",\"\"),\" - \",IF(AN128=J128,\"[b]\",\"\"),Коэффициенты!G128,IF(AN128=J128,\"[/b]\",\"\"),\" )\",IF(J128=\"\",$M$13,\"\"))),\"\"),\"\")","v":""},null,null,null,null,null,null,null,null,null,null,{"$f":"IF(Коэффициенты!L128<>\"\",Коэффициенты!L128,\"\")","v":118},{"$f":"IF(Коэффициенты!M128<>\"\",Коэффициенты!M128,\"\")","v":""},"(WC)",null,null,null,null,null,null,null,null,null,null,null,null,null,null,null,null,null,null,null,null,{"$f":"IF(Коэффициенты!D128<>\"\",Коэффициенты!D128,\"\")","v":""},{"$f":"IF(Коэффициенты!E128<>\"\",Коэффициенты!E128,\"\")","v":""},""]
[null,{"$f":"IF(Коэффициенты!B129<>\"\",Коэффициенты!B129,\"\")","v":""},"",{"$f":"IF(Коэффициенты!C129<>\"\",Коэффициенты!C129,\"\")","v":""},{"$f":"IF(AND(AM129<>\"\",AN129<>\"\"),IF(OR(AM129<>\"\",AN129<>\"\"),IF(AN129=\"bye\",CONCATENATE($M$16,AM129,IF(AND(AM129<>\"\",AM129<>\"(Q)\"),VLOOKUP(AM129,$Q$11:$R$200,2,0),\"\"),\"..... vs \",AN129,$M$17),CONCATENATE(IF(J129=\"\",$M$12,\"\"),IF(AM129=J129,\"[b]\",\"\"),AM129,IF(AND(AM129<>\"\",AM129<>\"(Q)\"),VLOOKUP(AM129,$Q$11:$R$200,2,0),\"\"),IF(AM129=J129,\"[/b]\",\"\"),\"..... vs \",IF(AN129=J129,\"[b]\",\"\"),AN129,IF(AND(AN129<>\"\",AN129<>\"(Q)\"),VLOOKUP(AN129,$Q$11:$R$200,2,0),\"\"),IF(AN129=J129,\"[/b]\",\"\"),\"..... ( \",IF(AM129=J129,\"[b]\",\"\"),Коэффициенты!F129,IF(AM129=J129,\"[/b]\",\"\"),\" - \",IF(AN129=J129,\"[b]\",\"\"),Коэффициенты!G129,IF(AN129=J129,\"[/b]\",\"\"),\" )\",IF(J129=\"\",$M$13,\"\"))),\"\"),\"\")","v":""},null,null,null,null,null,null,null,null,null,null,{"$f":"IF(Коэффициенты!L129<>\"\",Коэффициенты!L129,\"\")","v":119},{"$f":"IF(Коэффициенты!M129<>\"\",Коэффициенты!M129,\"\")","v":""},"(WC)",null,null,null,null,null,null,null,null,null,null,null,null,null,null,null,null,null,null,null,null,{"$f":"IF(Коэффициенты!D129<>\"\",Коэффициенты!D129,\"\")","v":""},{"$f":"IF(Коэффициенты!E129<>\"\",Коэффициенты!E129,\"\")","v":""},""]
[null,{"$f":"IF(Коэффициенты!B130<>\"\",Коэффициенты!B130,\"\")","v":""},"",{"$f":"IF(Коэффициенты!C130<>\"\",Коэффициенты!C130,\"\")","v":""},{"$f":"IF(AND(AM130<>\"\",AN130<>\"\"),IF(OR(AM130<>\"\",AN130<>\"\"),IF(AN130=\"bye\",CONCATENATE($M$16,AM130,IF(AND(AM130<>\"\",AM130<>\"(Q)\"),VLOOKUP(AM130,$Q$11:$R$200,2,0),\"\"),\"..... vs \",AN130,$M$17),CONCATENATE(IF(J130=\"\",$M$12,\"\"),IF(AM130=J130,\"[b]\",\"\"),AM130,IF(AND(AM130<>\"\",AM130<>\"(Q)\"),VLOOKUP(AM130,$Q$11:$R$200,2,0),\"\"),IF(AM130=J130,\"[/b]\",\"\"),\"..... vs \",IF(AN130=J130,\"[b]\",\"\"),AN130,IF(AND(AN130<>\"\",AN130<>\"(Q)\"),VLOOKUP(AN130,$Q$11:$R$200,2,0),\"\"),IF(AN130=J130,\"[/b]\",\"\"),\"..... ( \",IF(AM130=J130,\"[b]\",\"\"),Коэффициенты!F130,IF(AM130=J130,\"[/b]\",\"\"),\" - \",IF(AN130=J130,\"[b]\",\"\"),Коэффициенты!G130,IF(AN130=J130,\"[/b]\",\"\"),\" )\",IF(J130=\"\",$M$13,\"\"))),\"\"),\"\")","v":""},null,null,null,null,null,null,null,null,null,null,{"$f":"IF(Коэффициенты!L130<>\"\",Коэффициенты!L130,\"\")","v":120},{"$f":"IF(Коэффициенты!M130<>\"\",Коэффициенты!M130,\"\")","v":""},"(WC)",null,null,null,null,null,null,null,null,null,null,null,null,null,null,null,null,null,null,null,null,{"$f":"IF(Коэффициенты!D130<>\"\",Коэффициенты!D130,\"\")","v":""},{"$f":"IF(Коэффициенты!E130<>\"\",Коэффициенты!E130,\"\")","v":""},""]
[null,{"$f":"IF(Коэффициенты!B131<>\"\",Коэффициенты!B131,\"\")","v":""},"",{"$f":"IF(Коэффициенты!C131<>\"\",Коэффициенты!C131,\"\")","v":""},{"$f":"IF(AND(AM131<>\"\",AN131<>\"\"),IF(OR(AM131<>\"\",AN131<>\"\"),IF(AN131=\"bye\",CONCATENATE($M$16,AM131,IF(AND(AM131<>\"\",AM131<>\"(Q)\"),VLOOKUP(AM131,$Q$11:$R$200,2,0),\"\"),\"..... vs \",AN131,$M$17),CONCATENATE(IF(J131=\"\",$M$12,\"\"),IF(AM131=J131,\"[b]\",\"\"),AM131,IF(AND(AM131<>\"\",AM131<>\"(Q)\"),VLOOKUP(AM131,$Q$11:$R$200,2,0),\"\"),IF(AM131=J131,\"[/b]\",\"\"),\"..... vs \",IF(AN131=J131,\"[b]\",\"\"),AN131,IF(AND(AN131<>\"\",AN131<>\"(Q)\"),VLOOKUP(AN131,$Q$11:$R$200,2,0),\"\"),IF(AN131=J131,\"[/b]\",\"\"),\"..... ( \",IF(AM131=J131,\"[b]\",\"\"),Коэффициенты!F131,IF(AM131=J131,\"[/b]\",\"\"),\" - \",IF(AN131=J131,\"[b]\",\"\"),Коэффициенты!G131,IF(AN131=J131,\"[/b]\",\"\"),\" )\",IF(J131=\"\",$M$13,\"\"))),\"\"),\"\")","v":""},null,null,null,null,null,null,null,null,null,null,{"$f":"IF(Коэффициенты!L131<>\"\",Коэффициенты!L131,\"\")","v":121},{"$f":"IF(Коэффициенты!M131<>\"\",Коэффициенты!M131,\"\")","v":""},"(WC)",null,null,null,null,null,null,null,null,null,null,null,null,null,null,null,null,null,null,null,null,{"$f":"IF(Коэффициенты!D131<>\"\",Коэффициенты!D131,\"\")","v":""},{"$f":"IF(Коэффициенты!E131<>\"\",Коэффициенты!E131,\"\")","v":""},""]
[null,{"$f":"IF(Коэффициенты!B132<>\"\",Коэффициенты!B132,\"\")","v":""},"",{"$f":"IF(Коэффициенты!C132<>\"\",Коэффициенты!C132,\"\")","v":""},{"$f":"IF(AND(AM132<>\"\",AN132<>\"\"),IF(OR(AM132<>\"\",AN132<>\"\"),IF(AN132=\"bye\",CONCATENATE($M$16,AM132,IF(AND(AM132<>\"\",AM132<>\"(Q)\"),VLOOKUP(AM132,$Q$11:$R$200,2,0),\"\"),\"..... vs \",AN132,$M$17),CONCATENATE(IF(J132=\"\",$M$12,\"\"),IF(AM132=J132,\"[b]\",\"\"),AM132,IF(AND(AM132<>\"\",AM132<>\"(Q)\"),VLOOKUP(AM132,$Q$11:$R$200,2,0),\"\"),IF(AM132=J132,\"[/b]\",\"\"),\"..... vs \",IF(AN132=J132,\"[b]\",\"\"),AN132,IF(AND(AN132<>\"\",AN132<>\"(Q)\"),VLOOKUP(AN132,$Q$11:$R$200,2,0),\"\"),IF(AN132=J132,\"[/b]\",\"\"),\"..... ( \",IF(AM132=J132,\"[b]\",\"\"),Коэффициенты!F132,IF(AM132=J132,\"[/b]\",\"\"),\" - \",IF(AN132=J132,\"[b]\",\"\"),Коэффициенты!G132,IF(AN132=J132,\"[/b]\",\"\"),\" )\",IF(J132=\"\",$M$13,\"\"))),\"\"),\"\")","v":""},null,null,null,null,null,null,null,null,null,null,{"$f":"IF(Коэффициенты!L132<>\"\",Коэффициенты!L132,\"\")","v":122},{"$f":"IF(Коэффициенты!M132<>\"\",Коэффициенты!M132,\"\")","v":""},"(Q)",null,null,null,null,null,null,null,null,null,null,null,null,null,null,null,null,null,null,null,null,{"$f":"IF(Коэффициенты!D132<>\"\",Коэффициенты!D132,\"\")","v":""},{"$f":"IF(Коэффициенты!E132<>\"\",Коэффициенты!E132,\"\")","v":""},""]
[null,{"$f":"IF(Коэффициенты!B133<>\"\",Коэффициенты!B133,\"\")","v":""},"",{"$f":"IF(Коэффициенты!C133<>\"\",Коэффициенты!C133,\"\")","v":""},{"$f":"IF(AND(AM133<>\"\",AN133<>\"\"),IF(OR(AM133<>\"\",AN133<>\"\"),IF(AN133=\"bye\",CONCATENATE($M$16,AM133,IF(AND(AM133<>\"\",AM133<>\"(Q)\"),VLOOKUP(AM133,$Q$11:$R$200,2,0),\"\"),\"..... vs \",AN133,$M$17),CONCATENATE(IF(J133=\"\",$M$12,\"\"),IF(AM133=J133,\"[b]\",\"\"),AM133,IF(AND(AM133<>\"\",AM133<>\"(Q)\"),VLOOKUP(AM133,$Q$11:$R$200,2,0),\"\"),IF(AM133=J133,\"[/b]\",\"\"),\"..... vs \",IF(AN133=J133,\"[b]\",\"\"),AN133,IF(AND(AN133<>\"\",AN133<>\"(Q)\"),VLOOKUP(AN133,$Q$11:$R$200,2,0),\"\"),IF(AN133=J133,\"[/b]\",\"\"),\"..... ( \",IF(AM133=J133,\"[b]\",\"\"),Коэффициенты!F133,IF(AM133=J133,\"[/b]\",\"\"),\" - \",IF(AN133=J133,\"[b]\",\"\"),Коэффициенты!G133,IF(AN133=J133,\"[/b]\",\"\"),\" )\",IF(J133=\"\",$M$13,\"\"))),\"\"),\"\")","v":""},null,null,null,null,null,null,null,null,null,null,{"$f":"IF(Коэффициенты!L133<>\"\",Коэффициенты!L133,\"\")","v":123},{"$f":"IF(Коэффициенты!M133<>\"\",Коэффициенты!M133,\"\")","v":""},"(Q)",null,null,null,null,null,null,null,null,null,null,null,null,null,null,null,null,null,null,null,null,{"$f":"IF(Коэффициенты!D133<>\"\",Коэффициенты!D133,\"\")","v":""},{"$f":"IF(Коэффициенты!E133<>\"\",Коэффициенты!E133,\"\")","v":""},""]
[null,{"$f":"IF(Коэффициенты!B134<>\"\",Коэффициенты!B134,\"\")","v":""},"",{"$f":"IF(Коэффициенты!C134<>\"\",Коэффициенты!C134,\"\")","v":""},{"$f":"IF(AND(AM134<>\"\",AN134<>\"\"),IF(OR(AM134<>\"\",AN134<>\"\"),IF(AN134=\"bye\",CONCATENATE($M$16,AM134,IF(AND(AM134<>\"\",AM134<>\"(Q)\"),VLOOKUP(AM134,$Q$11:$R$200,2,0),\"\"),\"..... vs \",AN134,$M$17),CONCATENATE(IF(J134=\"\",$M$12,\"\"),IF(AM134=J134,\"[b]\",\"\"),AM134,IF(AND(AM134<>\"\",AM134<>\"(Q)\"),VLOOKUP(AM134,$Q$11:$R$200,2,0),\"\"),IF(AM134=J134,\"[/b]\",\"\"),\"..... vs \",IF(AN134=J134,\"[b]\",\"\"),AN134,IF(AND(AN134<>\"\",AN134<>\"(Q)\"),VLOOKUP(AN134,$Q$11:$R$200,2,0),\"\"),IF(AN134=J134,\"[/b]\",\"\"),\"..... ( \",IF(AM134=J134,\"[b]\",\"\"),Коэффициенты!F134,IF(AM134=J134,\"[/b]\",\"\"),\" - \",IF(AN134=J134,\"[b]\",\"\"),Коэффициенты!G134,IF(AN134=J134,\"[/b]\",\"\"),\" )\",IF(J134=\"\",$M$13,\"\"))),\"\"),\"\")","v":""},null,null,null,null,null,null,null,null,null,null,{"$f":"IF(Коэффициенты!L134<>\"\",Коэффициенты!L134,\"\")","v":124},{"$f":"IF(Коэффициенты!M134<>\"\",Коэффициенты!M134,\"\")","v":""},"(Q)",null,null,null,null,null,null,null,null,null,null,null,null,null,null,null,null,null,null,null,null,{"$f":"IF(Коэффициенты!D134<>\"\",Коэффициенты!D134,\"\")","v":""},{"$f":"IF(Коэффициенты!E134<>\"\",Коэффициенты!E134,\"\")","v":""},""]
[null,{"$f":"IF(Коэффициенты!B135<>\"\",Коэффициенты!B135,\"\")","v":""},"",{"$f":"IF(Коэффициенты!C135<>\"\",Коэффициенты!C135,\"\")","v":""},{"$f":"IF(AND(AM135<>\"\",AN135<>\"\"),IF(OR(AM135<>\"\",AN135<>\"\"),IF(AN135=\"bye\",CONCATENATE($M$16,AM135,IF(AND(AM135<>\"\",AM135<>\"(Q)\"),VLOOKUP(AM135,$Q$11:$R$200,2,0),\"\"),\"..... vs \",AN135,$M$17),CONCATENATE(IF(J135=\"\",$M$12,\"\"),IF(AM135=J135,\"[b]\",\"\"),AM135,IF(AND(AM135<>\"\",AM135<>\"(Q)\"),VLOOKUP(AM135,$Q$11:$R$200,2,0),\"\"),IF(AM135=J135,\"[/b]\",\"\"),\"..... vs \",IF(AN135=J135,\"[b]\",\"\"),AN135,IF(AND(AN135<>\"\",AN135<>\"(Q)\"),VLOOKUP(AN135,$Q$11:$R$200,2,0),\"\"),IF(AN135=J135,\"[/b]\",\"\"),\"..... ( \",IF(AM135=J135,\"[b]\",\"\"),Коэффициенты!F135,IF(AM135=J135,\"[/b]\",\"\"),\" - \",IF(AN135=J135,\"[b]\",\"\"),Коэффициенты!G135,IF(AN135=J135,\"[/b]\",\"\"),\" )\",IF(J135=\"\",$M$13,\"\"))),\"\"),\"\")","v":""},null,null,null,null,null,null,null,null,null,null,{"$f":"IF(Коэффициенты!L135<>\"\",Коэффициенты!L135,\"\")","v":125},{"$f":"IF(Коэффициенты!M135<>\"\",Коэффициенты!M135,\"\")","v":""},"(Q)",null,null,null,null,null,null,null,null,null,null,null,null,null,null,null,null,null,null,null,null,{"$f":"IF(Коэффициенты!D135<>\"\",Коэффициенты!D135,\"\")","v":""},{"$f":"IF(Коэффициенты!E135<>\"\",Коэффициенты!E135,\"\")","v":""},""]
[null,{"$f":"IF(Коэффициенты!B136<>\"\",Коэффициенты!B136,\"\")","v":""},"",{"$f":"IF(Коэффициенты!C136<>\"\",Коэффициенты!C136,\"\")","v":""},{"$f":"IF(AND(AM136<>\"\",AN136<>\"\"),IF(OR(AM136<>\"\",AN136<>\"\"),IF(AN136=\"bye\",CONCATENATE($M$16,AM136,IF(AND(AM136<>\"\",AM136<>\"(Q)\"),VLOOKUP(AM136,$Q$11:$R$200,2,0),\"\"),\"..... vs \",AN136,$M$17),CONCATENATE(IF(J136=\"\",$M$12,\"\"),IF(AM136=J136,\"[b]\",\"\"),AM136,IF(AND(AM136<>\"\",AM136<>\"(Q)\"),VLOOKUP(AM136,$Q$11:$R$200,2,0),\"\"),IF(AM136=J136,\"[/b]\",\"\"),\"..... vs \",IF(AN136=J136,\"[b]\",\"\"),AN136,IF(AND(AN136<>\"\",AN136<>\"(Q)\"),VLOOKUP(AN136,$Q$11:$R$200,2,0),\"\"),IF(AN136=J136,\"[/b]\",\"\"),\"..... ( \",IF(AM136=J136,\"[b]\",\"\"),Коэффициенты!F136,IF(AM136=J136,\"[/b]\",\"\"),\" - \",IF(AN136=J136,\"[b]\",\"\"),Коэффициенты!G136,IF(AN136=J136,\"[/b]\",\"\"),\" )\",IF(J136=\"\",$M$13,\"\"))),\"\"),\"\")","v":""},null,null,null,null,null,null,null,null,null,null,{"$f":"IF(Коэффициенты!L136<>\"\",Коэффициенты!L136,\"\")","v":126},{"$f":"IF(Коэффициенты!M136<>\"\",Коэффициенты!M136,\"\")","v":""},"(Q)",null,null,null,null,null,null,null,null,null,null,null,null,null,null,null,null,null,null,null,null,{"$f":"IF(Коэффициенты!D136<>\"\",Коэффициенты!D136,\"\")","v":""},{"$f":"IF(Коэффициенты!E136<>\"\",Коэффициенты!E136,\"\")","v":""},""]
[null,{"$f":"IF(Коэффициенты!B137<>\"\",Коэффициенты!B137,\"\")","v":""},"",{"$f":"IF(Коэффициенты!C137<>\"\",Коэффициенты!C137,\"\")","v":""},{"$f":"IF(AND(AM137<>\"\",AN137<>\"\"),IF(OR(AM137<>\"\",AN137<>\"\"),IF(AN137=\"bye\",CONCATENATE($M$16,AM137,IF(AND(AM137<>\"\",AM137<>\"(Q)\"),VLOOKUP(AM137,$Q$11:$R$200,2,0),\"\"),\"..... vs \",AN137,$M$17),CONCATENATE(IF(J137=\"\",$M$12,\"\"),IF(AM137=J137,\"[b]\",\"\"),AM137,IF(AND(AM137<>\"\",AM137<>\"(Q)\"),VLOOKUP(AM137,$Q$11:$R$200,2,0),\"\"),IF(AM137=J137,\"[/b]\",\"\"),\"..... vs \",IF(AN137=J137,\"[b]\",\"\"),AN137,IF(AND(AN137<>\"\",AN137<>\"(Q)\"),VLOOKUP(AN137,$Q$11:$R$200,2,0),\"\"),IF(AN137=J137,\"[/b]\",\"\"),\"..... ( \",IF(AM137=J137,\"[b]\",\"\"),Коэффициенты!F137,IF(AM137=J137,\"[/b]\",\"\"),\" - \",IF(AN137=J137,\"[b]\",\"\"),Коэффициенты!G137,IF(AN137=J137,\"[/b]\",\"\"),\" )\",IF(J137=\"\",$M$13,\"\"))),\"\"),\"\")","v":""},null,null,null,null,null,null,null,null,null,null,{"$f":"IF(Коэффициенты!L137<>\"\",Коэффициенты!L137,\"\")","v":127},{"$f":"IF(Коэффициенты!M137<>\"\",Коэффициенты!M137,\"\")","v":""},"(Q)",null,null,null,null,null,null,null,null,null,null,null,null,null,null,null,null,null,null,null,null,{"$f":"IF(Коэффициенты!D137<>\"\",Коэффициенты!D137,\"\")","v":""},{"$f":"IF(Коэффициенты!E137<>\"\",Коэффициенты!E137,\"\")","v":""},""]
[null,{"$f":"IF(Коэффициенты!B138<>\"\",Коэффициенты!B138,\"\")","v":""},"",{"$f":"IF(Коэффициенты!C138<>\"\",Коэффициенты!C138,\"\")","v":""},{"$f":"IF(AND(AM138<>\"\",AN138<>\"\"),IF(OR(AM138<>\"\",AN138<>\"\"),IF(AN138=\"bye\",CONCATENATE($M$16,AM138,IF(AND(AM138<>\"\",AM138<>\"(Q)\"),VLOOKUP(AM138,$Q$11:$R$200,2,0),\"\"),\"..... vs \",AN138,$M$17),CONCATENATE(IF(J138=\"\",$M$12,\"\"),IF(AM138=J138,\"[b]\",\"\"),AM138,IF(AND(AM138<>\"\",AM138<>\"(Q)\"),VLOOKUP(AM138,$Q$11:$R$200,2,0),\"\"),IF(AM138=J138,\"[/b]\",\"\"),\"..... vs \",IF(AN138=J138,\"[b]\",\"\"),AN138,IF(AND(AN138<>\"\",AN138<>\"(Q)\"),VLOOKUP(AN138,$Q$11:$R$200,2,0),\"\"),IF(AN138=J138,\"[/b]\",\"\"),\"..... ( \",IF(AM138=J138,\"[b]\",\"\"),Коэффициенты!F138,IF(AM138=J138,\"[/b]\",\"\"),\" - \",IF(AN138=J138,\"[b]\",\"\"),Коэффициенты!G138,IF(AN138=J138,\"[/b]\",\"\"),\" )\",IF(J138=\"\",$M$13,\"\"))),\"\"),\"\")","v":""},null,null,null,null,null,null,null,null,null,null,{"$f":"IF(Коэффициенты!L138<>\"\",Коэффициенты!L138,\"\")","v":128},{"$f":"IF(Коэффициенты!M138<>\"\",Коэффициенты!M138,\"\")","v":""},"(Q)",null,null,null,null,null,null,null,null,null,null,null,null,null,null,null,null,null,null,null,null,{"$f":"IF(Коэффициенты!D138<>\"\",Коэффициенты!D138,\"\")","v":""},{"$f":"IF(Коэффициенты!E138<>\"\",Коэффициенты!E138,\"\")","v":""},""]
[null,{"$f":"IF(Коэффициенты!B139<>\"\",Коэффициенты!B139,\"\")","v":""},{"$f":"IF(B139<>\"\",CONCATENATE($M$20,B139,$M$21),\"\")","v":""},{"$f":"IF(Коэффициенты!C139<>\"\",Коэффициенты!C139,\"\")","v":""},{"$f":"IF(AND(AM139<>\"\",AN139<>\"\"),IF(OR(AM139<>\"\",AN139<>\"\"),IF(AN139=\"bye\",CONCATENATE($M$16,AM139,IF(AND(AM139<>\"\",AM139<>\"(Q)\"),VLOOKUP(AM139,$Q$11:$R$200,2,0),\"\"),\"..... vs \",AN139,$M$17),CONCATENATE(IF(J139=\"\",$M$12,\"\"),IF(AM139=J139,\"[b]\",\"\"),AM139,IF(AND(AM139<>\"\",AM139<>\"(Q)\"),VLOOKUP(AM139,$Q$11:$R$200,2,0),\"\"),IF(AM139=J139,\"[/b]\",\"\"),\"..... vs \",IF(AN139=J139,\"[b]\",\"\"),AN139,IF(AND(AN139<>\"\",AN139<>\"(Q)\"),VLOOKUP(AN139,$Q$11:$R$200,2,0),\"\"),IF(AN139=J139,\"[/b]\",\"\"),\"..... ( \",IF(AM139=J139,\"[b]\",\"\"),Коэффициенты!F139,IF(AM139=J139,\"[/b]\",\"\"),\" - \",IF(AN139=J139,\"[b]\",\"\"),Коэффициенты!G139,IF(AN139=J139,\"[/b]\",\"\"),\" )\",IF(J139=\"\",$M$13,\"\"))),\"\"),\"\")","v":""},null,null,null,null,null,null,null,null,null,null,{"$f":"IF(Коэффициенты!L139<>\"\",Коэффициенты!L139,\"\")","v":""},{"$f":"IF(Коэффициенты!M139<>\"\",Коэффициенты!M139,\"\")","v":""},"(Q)",null,null,null,null,null,null,null,null,null,null,null,null,null,null,null,null,null,null,null,null,{"$f":"IF(Коэффициенты!D139<>\"\",Коэффициенты!D139,\"\")","v":""},{"$f":"IF(Коэффициенты!E139<>\"\",Коэффициенты!E139,\"\")","v":""},""]
[null,{"$f":"IF(Коэффициенты!B140<>\"\",Коэффициенты!B140,\"\")","v":""},"",{"$f":"IF(Коэффициенты!C140<>\"\",Коэффициенты!C140,\"\")","v":""},{"$f":"IF(AND(AM140<>\"\",AN140<>\"\"),IF(OR(AM140<>\"\",AN140<>\"\"),IF(AN140=\"bye\",CONCATENATE($M$16,AM140,IF(AND(AM140<>\"\",AM140<>\"(Q)\"),VLOOKUP(AM140,$Q$11:$R$200,2,0),\"\"),\"..... vs \",AN140,$M$17),CONCATENATE(IF(J140=\"\",$M$12,\"\"),IF(AM140=J140,\"[b]\",\"\"),AM140,IF(AND(AM140<>\"\",AM140<>\"(Q)\"),VLOOKUP(AM140,$Q$11:$R$200,2,0),\"\"),IF(AM140=J140,\"[/b]\",\"\"),\"..... vs \",IF(AN140=J140,\"[b]\",\"\"),AN140,IF(AND(AN140<>\"\",AN140<>\"(Q)\"),VLOOKUP(AN140,$Q$11:$R$200,2,0),\"\"),IF(AN140=J140,\"[/b]\",\"\"),\"..... ( \",IF(AM140=J140,\"[b]\",\"\"),Коэффициенты!F140,IF(AM140=J140,\"[/b]\",\"\"),\" - \",IF(AN140=J140,\"[b]\",\"\"),Коэффициенты!G140,IF(AN140=J140,\"[/b]\",\"\"),\" )\",IF(J140=\"\",$M$13,\"\"))),\"\"),\"\")","v":""},null,null,null,null,null,null,null,null,null,null,{"$f":"IF(Коэффициенты!L140<>\"\",Коэффициенты!L140,\"\")","v":""},{"$f":"IF(Коэффициенты!M140<>\"\",Коэффициенты!M140,\"\")","v":""},"(Q)",null,null,null,null,null,null,null,null,null,null,null,null,null,null,null,null,null,null,null,null,{"$f":"IF(Коэффициенты!D140<>\"\",Коэффициенты!D140,\"\")","v":""},{"$f":"IF(Коэффициенты!E140<>\"\",Коэффициенты!E140,\"\")","v":""},""]
[null,{"$f":"IF(Коэффициенты!B141<>\"\",Коэффициенты!B141,\"\")","v":""},"",{"$f":"IF(Коэффициенты!C141<>\"\",Коэффициенты!C141,\"\")","v":""},{"$f":"IF(AND(AM141<>\"\",AN141<>\"\"),IF(OR(AM141<>\"\",AN141<>\"\"),IF(AN141=\"bye\",CONCATENATE($M$16,AM141,IF(AND(AM141<>\"\",AM141<>\"(Q)\"),VLOOKUP(AM141,$Q$11:$R$200,2,0),\"\"),\"..... vs \",AN141,$M$17),CONCATENATE(IF(J141=\"\",$M$12,\"\"),IF(AM141=J141,\"[b]\",\"\"),AM141,IF(AND(AM141<>\"\",AM141<>\"(Q)\"),VLOOKUP(AM141,$Q$11:$R$200,2,0),\"\"),IF(AM141=J141,\"[/b]\",\"\"),\"..... vs \",IF(AN141=J141,\"[b]\",\"\"),AN141,IF(AND(AN141<>\"\",AN141<>\"(Q)\"),VLOOKUP(AN141,$Q$11:$R$200,2,0),\"\"),IF(AN141=J141,\"[/b]\",\"\"),\"..... ( \",IF(AM141=J141,\"[b]\",\"\"),Коэффициенты!F141,IF(AM141=J141,\"[/b]\",\"\"),\" - \",IF(AN141=J141,\"[b]\",\"\"),Коэффициенты!G141,IF(AN141=J141,\"[/b]\",\"\"),\" )\",IF(J141=\"\",$M$13,\"\"))),\"\"),\"\")","v":""},null,null,null,null,null,null,null,null,null,null,{"$f":"IF(Коэффициенты!L141<>\"\",Коэффициенты!L141,\"\")","v":""},{"$f":"IF(Коэффициенты!M141<>\"\",Коэффициенты!M141,\"\")","v":""},"(Q)",null,null,null,null,null,null,null,null,null,null,null,null,null,null,null,null,null,null,null,null,{"$f":"IF(Коэффициенты!D141<>\"\",Коэффициенты!D141,\"\")","v":""},{"$f":"IF(Коэффициенты!E141<>\"\",Коэффициенты!E141,\"\")","v":""},""]
[null,{"$f":"IF(Коэффициенты!B142<>\"\",Коэффициенты!B142,\"\")","v":""},"",{"$f":"IF(Коэффициенты!C142<>\"\",Коэффициенты!C142,\"\")","v":""},{"$f":"IF(AND(AM142<>\"\",AN142<>\"\"),IF(OR(AM142<>\"\",AN142<>\"\"),IF(AN142=\"bye\",CONCATENATE($M$16,AM142,IF(AND(AM142<>\"\",AM142<>\"(Q)\"),VLOOKUP(AM142,$Q$11:$R$200,2,0),\"\"),\"..... vs \",AN142,$M$17),CONCATENATE(IF(J142=\"\",$M$12,\"\"),IF(AM142=J142,\"[b]\",\"\"),AM142,IF(AND(AM142<>\"\",AM142<>\"(Q)\"),VLOOKUP(AM142,$Q$11:$R$200,2,0),\"\"),IF(AM142=J142,\"[/b]\",\"\"),\"..... vs \",IF(AN142=J142,\"[b]\",\"\"),AN142,IF(AND(AN142<>\"\",AN142<>\"(Q)\"),VLOOKUP(AN142,$Q$11:$R$200,2,0),\"\"),IF(AN142=J142,\"[/b]\",\"\"),\"..... ( \",IF(AM142=J142,\"[b]\",\"\"),Коэффициенты!F142,IF(AM142=J142,\"[/b]\",\"\"),\" - \",IF(AN142=J142,\"[b]\",\"\"),Коэффициенты!G142,IF(AN142=J142,\"[/b]\",\"\"),\" )\",IF(J142=\"\",$M$13,\"\"))),\"\"),\"\")","v":""},null,null,null,null,null,null,null,null,null,null,{"$f":"IF(Коэффициенты!L142<>\"\",Коэффициенты!L142,\"\")","v":""},{"$f":"IF(Коэффициенты!M142<>\"\",Коэффициенты!M142,\"\")","v":""},"(LL)",null,null,null,null,null,null,null,null,null,null,null,null,null,null,null,null,null,null,null,null,{"$f":"IF(Коэффициенты!D142<>\"\",Коэффициенты!D142,\"\")","v":""},{"$f":"IF(Коэффициенты!E142<>\"\",Коэффициенты!E142,\"\")","v":""},""]
[null,{"$f":"IF(Коэффициенты!B143<>\"\",Коэффициенты!B143,\"\")","v":""},"",{"$f":"IF(Коэффициенты!C143<>\"\",Коэффициенты!C143,\"\")","v":""},{"$f":"IF(AND(AM143<>\"\",AN143<>\"\"),IF(OR(AM143<>\"\",AN143<>\"\"),IF(AN143=\"bye\",CONCATENATE($M$16,AM143,IF(AND(AM143<>\"\",AM143<>\"(Q)\"),VLOOKUP(AM143,$Q$11:$R$200,2,0),\"\"),\"..... vs \",AN143,$M$17),CONCATENATE(IF(J143=\"\",$M$12,\"\"),IF(AM143=J143,\"[b]\",\"\"),AM143,IF(AND(AM143<>\"\",AM143<>\"(Q)\"),VLOOKUP(AM143,$Q$11:$R$200,2,0),\"\"),IF(AM143=J143,\"[/b]\",\"\"),\"..... vs \",IF(AN143=J143,\"[b]\",\"\"),AN143,IF(AND(AN143<>\"\",AN143<>\"(Q)\"),VLOOKUP(AN143,$Q$11:$R$200,2,0),\"\"),IF(AN143=J143,\"[/b]\",\"\"),\"..... ( \",IF(AM143=J143,\"[b]\",\"\"),Коэффициенты!F143,IF(AM143=J143,\"[/b]\",\"\"),\" - \",IF(AN143=J143,\"[b]\",\"\"),Коэффициенты!G143,IF(AN143=J143,\"[/b]\",\"\"),\" )\",IF(J143=\"\",$M$13,\"\"))),\"\"),\"\")","v":""},null,null,null,null,null,null,null,null,null,null,{"$f":"IF(Коэффициенты!L143<>\"\",Коэффициенты!L143,\"\")","v":""},{"$f":"IF(Коэффициенты!M143<>\"\",Коэффициенты!M143,\"\")","v":""},"(Q)",null,null,null,null,null,null,null,null,null,null,null,null,null,null,null,null,null,null,null,null,{"$f":"IF(Коэффициенты!D143<>\"\",Коэффициенты!D143,\"\")","v":""},{"$f":"IF(Коэффициенты!E143<>\"\",Коэффициенты!E143,\"\")","v":""},""]
[null,{"$f":"IF(Коэффициенты!B144<>\"\",Коэффициенты!B144,\"\")","v":""},"",{"$f":"IF(Коэффициенты!C144<>\"\",Коэффициенты!C144,\"\")","v":""},{"$f":"IF(AND(AM144<>\"\",AN144<>\"\"),IF(OR(AM144<>\"\",AN144<>\"\"),IF(AN144=\"bye\",CONCATENATE($M$16,AM144,IF(AND(AM144<>\"\",AM144<>\"(Q)\"),VLOOKUP(AM144,$Q$11:$R$200,2,0),\"\"),\"..... vs \",AN144,$M$17),CONCATENATE(IF(J144=\"\",$M$12,\"\"),IF(AM144=J144,\"[b]\",\"\"),AM144,IF(AND(AM144<>\"\",AM144<>\"(Q)\"),VLOOKUP(AM144,$Q$11:$R$200,2,0),\"\"),IF(AM144=J144,\"[/b]\",\"\"),\"..... vs \",IF(AN144=J144,\"[b]\",\"\"),AN144,IF(AND(AN144<>\"\",AN144<>\"(Q)\"),VLOOKUP(AN144,$Q$11:$R$200,2,0),\"\"),IF(AN144=J144,\"[/b]\",\"\"),\"..... ( \",IF(AM144=J144,\"[b]\",\"\"),Коэффициенты!F144,IF(AM144=J144,\"[/b]\",\"\"),\" - \",IF(AN144=J144,\"[b]\",\"\"),Коэффициенты!G144,IF(AN144=J144,\"[/b]\",\"\"),\" )\",IF(J144=\"\",$M$13,\"\"))),\"\"),\"\")","v":""},null,null,null,null,null,null,null,null,null,null,{"$f":"IF(Коэффициенты!L144<>\"\",Коэффициенты!L144,\"\")","v":""},{"$f":"IF(Коэффициенты!M144<>\"\",Коэффициенты!M144,\"\")","v":""},"(Q)",null,null,null,null,null,null,null,null,null,null,null,null,null,null,null,null,null,null,null,null,{"$f":"IF(Коэффициенты!D144<>\"\",Коэффициенты!D144,\"\")","v":""},{"$f":"IF(Коэффициенты!E144<>\"\",Коэффициенты!E144,\"\")","v":""},""]
[null,{"$f":"IF(Коэффициенты!B145<>\"\",Коэффициенты!B145,\"\")","v":""},"",{"$f":"IF(Коэффициенты!C145<>\"\",Коэффициенты!C145,\"\")","v":""},{"$f":"IF(AND(AM145<>\"\",AN145<>\"\"),IF(OR(AM145<>\"\",AN145<>\"\"),IF(AN145=\"bye\",CONCATENATE($M$16,AM145,IF(AND(AM145<>\"\",AM145<>\"(Q)\"),VLOOKUP(AM145,$Q$11:$R$200,2,0),\"\"),\"..... vs \",AN145,$M$17),CONCATENATE(IF(J145=\"\",$M$12,\"\"),IF(AM145=J145,\"[b]\",\"\"),AM145,IF(AND(AM145<>\"\",AM145<>\"(Q)\"),VLOOKUP(AM145,$Q$11:$R$200,2,0),\"\"),IF(AM145=J145,\"[/b]\",\"\"),\"..... vs \",IF(AN145=J145,\"[b]\",\"\"),AN145,IF(AND(AN145<>\"\",AN145<>\"(Q)\"),VLOOKUP(AN145,$Q$11:$R$200,2,0),\"\"),IF(AN145=J145,\"[/b]\",\"\"),\"..... ( \",IF(AM145=J145,\"[b]\",\"\"),Коэффициенты!F145,IF(AM145=J145,\"[/b]\",\"\"),\" - \",IF(AN145=J145,\"[b]\",\"\"),Коэффициенты!G145,IF(AN145=J145,\"[/b]\",\"\"),\" )\",IF(J145=\"\",$M$13,\"\"))),\"\"),\"\")","v":""},null,null,null,null,null,null,null,null,null,null,{"$f":"IF(Коэффициенты!L145<>\"\",Коэффициенты!L145,\"\")","v":""},{"$f":"IF(Коэффициенты!M145<>\"\",Коэффициенты!M145,\"\")","v":""},"(WC)",null,null,null,null,null,null,null,null,null,null,null,null,null,null,null,null,null,null,null,null,{"$f":"IF(Коэффициенты!D145<>\"\",Коэффициенты!D145,\"\")","v":""},{"$f":"IF(Коэффициенты!E145<>\"\",Коэффициенты!E145,\"\")","v":""},""]
[null,{"$f":"IF(Коэффициенты!B146<>\"\",Коэффициенты!B146,\"\")","v":""},"",{"$f":"IF(Коэффициенты!C146<>\"\",Коэффициенты!C146,\"\")","v":""},{"$f":"IF(AND(AM146<>\"\",AN146<>\"\"),IF(OR(AM146<>\"\",AN146<>\"\"),IF(AN146=\"bye\",CONCATENATE($M$16,AM146,IF(AND(AM146<>\"\",AM146<>\"(Q)\"),VLOOKUP(AM146,$Q$11:$R$200,2,0),\"\"),\"..... vs \",AN146,$M$17),CONCATENATE(IF(J146=\"\",$M$12,\"\"),IF(AM146=J146,\"[b]\",\"\"),AM146,IF(AND(AM146<>\"\",AM146<>\"(Q)\"),VLOOKUP(AM146,$Q$11:$R$200,2,0),\"\"),IF(AM146=J146,\"[/b]\",\"\"),\"..... vs \",IF(AN146=J146,\"[b]\",\"\"),AN146,IF(AND(AN146<>\"\",AN146<>\"(Q)\"),VLOOKUP(AN146,$Q$11:$R$200,2,0),\"\"),IF(AN146=J146,\"[/b]\",\"\"),\"..... ( \",IF(AM146=J146,\"[b]\",\"\"),Коэффициенты!F146,IF(AM146=J146,\"[/b]\",\"\"),\" - \",IF(AN146=J146,\"[b]\",\"\"),Коэффициенты!G146,IF(AN146=J146,\"[/b]\",\"\"),\" )\",IF(J146=\"\",$M$13,\"\"))),\"\"),\"\")","v":""},null,null,null,null,null,null,null,null,null,null,{"$f":"IF(Коэффициенты!L146<>\"\",Коэффициенты!L146,\"\")","v":""},{"$f":"IF(Коэффициенты!M146<>\"\",Коэффициенты!M146,\"\")","v":""},"(Q)",null,null,null,null,null,null,null,null,null,null,null,null,null,null,null,null,null,null,null,null,{"$f":"IF(Коэффициенты!D146<>\"\",Коэффициенты!D146,\"\")","v":""},{"$f":"IF(Коэффициенты!E146<>\"\",Коэффициенты!E146,\"\")","v":""},""]
[null,{"$f":"IF(Коэффициенты!B147<>\"\",Коэффициенты!B147,\"\")","v":""},"",{"$f":"IF(Коэффициенты!C147<>\"\",Коэффициенты!C147,\"\")","v":""},{"$f":"IF(AND(AM147<>\"\",AN147<>\"\"),IF(OR(AM147<>\"\",AN147<>\"\"),IF(AN147=\"bye\",CONCATENATE($M$16,AM147,IF(AND(AM147<>\"\",AM147<>\"(Q)\"),VLOOKUP(AM147,$Q$11:$R$200,2,0),\"\"),\"..... vs \",AN147,$M$17),CONCATENATE(IF(J147=\"\",$M$12,\"\"),IF(AM147=J147,\"[b]\",\"\"),AM147,IF(AND(AM147<>\"\",AM147<>\"(Q)\"),VLOOKUP(AM147,$Q$11:$R$200,2,0),\"\"),IF(AM147=J147,\"[/b]\",\"\"),\"..... vs \",IF(AN147=J147,\"[b]\",\"\"),AN147,IF(AND(AN147<>\"\",AN147<>\"(Q)\"),VLOOKUP(AN147,$Q$11:$R$200,2,0),\"\"),IF(AN147=J147,\"[/b]\",\"\"),\"..... ( \",IF(AM147=J147,\"[b]\",\"\"),Коэффициенты!F147,IF(AM147=J147,\"[/b]\",\"\"),\" - \",IF(AN147=J147,\"[b]\",\"\"),Коэффициенты!G147,IF(AN147=J147,\"[/b]\",\"\"),\" )\",IF(J147=\"\",$M$13,\"\"))),\"\"),\"\")","v":""},null,null,null,null,null,null,null,null,null,null,{"$f":"IF(Коэффициенты!L147<>\"\",Коэффициенты!L147,\"\")","v":""},{"$f":"IF(Коэффициенты!M147<>\"\",Коэффициенты!M147,\"\")","v":""},"(Q)",null,null,null,null,null,null,null,null,null,null,null,null,null,null,null,null,null,null,null,null,{"$f":"IF(Коэффициенты!D147<>\"\",Коэффициенты!D147,\"\")","v":""},{"$f":"IF(Коэффициенты!E147<>\"\",Коэффициенты!E147,\"\")","v":""},{"$f":"IF(AND(AM147<>\"\",AN147<>\"\"),\"…\",\"\")","v":""}]
[null,{"$f":"IF(Коэффициенты!B148<>\"\",Коэффициенты!B148,\"\")","v":""},"",{"$f":"IF(Коэффициенты!C148<>\"\",Коэффициенты!C148,\"\")","v":""},{"$f":"IF(AND(AM148<>\"\",AN148<>\"\"),IF(OR(AM148<>\"\",AN148<>\"\"),IF(AN148=\"bye\",CONCATENATE($M$16,AM148,IF(AND(AM148<>\"\",AM148<>\"(Q)\"),VLOOKUP(AM148,$Q$11:$R$200,2,0),\"\"),\"..... vs \",AN148,$M$17),CONCATENATE(IF(J148=\"\",$M$12,\"\"),IF(AM148=J148,\"[b]\",\"\"),AM148,IF(AND(AM148<>\"\",AM148<>\"(Q)\"),VLOOKUP(AM148,$Q$11:$R$200,2,0),\"\"),IF(AM148=J148,\"[/b]\",\"\"),\"..... vs \",IF(AN148=J148,\"[b]\",\"\"),AN148,IF(AND(AN148<>\"\",AN148<>\"(Q)\"),VLOOKUP(AN148,$Q$11:$R$200,2,0),\"\"),IF(AN148=J148,\"[/b]\",\"\"),\"..... ( \",IF(AM148=J148,\"[b]\",\"\"),Коэффициенты!F148,IF(AM148=J148,\"[/b]\",\"\"),\" - \",IF(AN148=J148,\"[b]\",\"\"),Коэффициенты!G148,IF(AN148=J148,\"[/b]\",\"\"),\" )\",IF(J148=\"\",$M$13,\"\"))),\"\"),\"\")","v":""},null,null,null,null,null,null,null,null,null,null,{"$f":"IF(Коэффициенты!L148<>\"\",Коэффициенты!L148,\"\")","v":""},{"$f":"IF(Коэффициенты!M148<>\"\",Коэффициенты!M148,\"\")","v":""},null,null,null,null,null,null,null,null,null,null,null,null,null,null,null,null,null,null,null,null,null,{"$f":"IF(Коэффициенты!D148<>\"\",Коэффициенты!D148,\"\")","v":""},{"$f":"IF(Коэффициенты!E148<>\"\",Коэффициенты!E148,\"\")","v":""},""]
[null,{"$f":"IF(Коэффициенты!B149<>\"\",Коэффициенты!B149,\"\")","v":""},"",{"$f":"IF(Коэффициенты!C149<>\"\",Коэффициенты!C149,\"\")","v":""},{"$f":"IF(AND(AM149<>\"\",AN149<>\"\"),IF(OR(AM149<>\"\",AN149<>\"\"),IF(AN149=\"bye\",CONCATENATE($M$16,AM149,IF(AND(AM149<>\"\",AM149<>\"(Q)\"),VLOOKUP(AM149,$Q$11:$R$200,2,0),\"\"),\"..... vs \",AN149,$M$17),CONCATENATE(IF(J149=\"\",$M$12,\"\"),IF(AM149=J149,\"[b]\",\"\"),AM149,IF(AND(AM149<>\"\",AM149<>\"(Q)\"),VLOOKUP(AM149,$Q$11:$R$200,2,0),\"\"),IF(AM149=J149,\"[/b]\",\"\"),\"..... vs \",IF(AN149=J149,\"[b]\",\"\"),AN149,IF(AND(AN149<>\"\",AN149<>\"(Q)\"),VLOOKUP(AN149,$Q$11:$R$200,2,0),\"\"),IF(AN149=J149,\"[/b]\",\"\"),\"..... ( \",IF(AM149=J149,\"[b]\",\"\"),Коэффициенты!F149,IF(AM149=J149,\"[/b]\",\"\"),\" - \",IF(AN149=J149,\"[b]\",\"\"),Коэффициенты!G149,IF(AN149=J149,\"[/b]\",\"\"),\" )\",IF(J149=\"\",$M$13,\"\"))),\"\"),\"\")","v":""},null,null,null,null,null,null,null,null,null,null,{"$f":"IF(Коэффициенты!L149<>\"\",Коэффициенты!L149,\"\")","v":""},null,null,null,null,null,null,null,null,null,null,null,null,null,null,null,null,null,null,null,null,null,null,{"$f":"IF(Коэффициенты!D149<>\"\",Коэффициенты!D149,\"\")","v":""},{"$f":"IF(Коэффициенты!E149<>\"\",Коэффициенты!E149,\"\")","v":""},""]
[null,{"$f":"IF(Коэффициенты!B150<>\"\",Коэффициенты!B150,\"\")","v":""},"",{"$f":"IF(Коэффициенты!C150<>\"\",Коэффициенты!C150,\"\")","v":""},{"$f":"IF(AND(AM150<>\"\",AN150<>\"\"),IF(OR(AM150<>\"\",AN150<>\"\"),IF(AN150=\"bye\",CONCATENATE($M$16,AM150,IF(AND(AM150<>\"\",AM150<>\"(Q)\"),VLOOKUP(AM150,$Q$11:$R$200,2,0),\"\"),\"..... vs \",AN150,$M$17),CONCATENATE(IF(J150=\"\",$M$12,\"\"),IF(AM150=J150,\"[b]\",\"\"),AM150,IF(AND(AM150<>\"\",AM150<>\"(Q)\"),VLOOKUP(AM150,$Q$11:$R$200,2,0),\"\"),IF(AM150=J150,\"[/b]\",\"\"),\"..... vs \",IF(AN150=J150,\"[b]\",\"\"),AN150,IF(AND(AN150<>\"\",AN150<>\"(Q)\"),VLOOKUP(AN150,$Q$11:$R$200,2,0),\"\"),IF(AN150=J150,\"[/b]\",\"\"),\"..... ( \",IF(AM150=J150,\"[b]\",\"\"),Коэффициенты!F150,IF(AM150=J150,\"[/b]\",\"\"),\" - \",IF(AN150=J150,\"[b]\",\"\"),Коэффициенты!G150,IF(AN150=J150,\"[/b]\",\"\"),\" )\",IF(J150=\"\",$M$13,\"\"))),\"\"),\"\")","v":""},null,null,null,null,null,null,null,null,null,null,{"$f":"IF(Коэффициенты!L150<>\"\",Коэффициенты!L150,\"\")","v":""},null,null,null,null,null,null,null,null,null,null,null,null,null,null,null,null,null,null,null,null,null,null,{"$f":"IF(Коэффициенты!D150<>\"\",Коэффициенты!D150,\"\")","v":""},{"$f":"IF(Коэффициенты!E150<>\"\",Коэффициенты!E150,\"\")","v":""},""]
[null,{"$f":"IF(Коэффициенты!B151<>\"\",Коэффициенты!B151,\"\")","v":""},"",{"$f":"IF(Коэффициенты!C151<>\"\",Коэффициенты!C151,\"\")","v":""},{"$f":"IF(AND(AM151<>\"\",AN151<>\"\"),IF(OR(AM151<>\"\",AN151<>\"\"),IF(AN151=\"bye\",CONCATENATE($M$16,AM151,IF(AND(AM151<>\"\",AM151<>\"(Q)\"),VLOOKUP(AM151,$Q$11:$R$200,2,0),\"\"),\"..... vs \",AN151,$M$17),CONCATENATE(IF(J151=\"\",$M$12,\"\"),IF(AM151=J151,\"[b]\",\"\"),AM151,IF(AND(AM151<>\"\",AM151<>\"(Q)\"),VLOOKUP(AM151,$Q$11:$R$200,2,0),\"\"),IF(AM151=J151,\"[/b]\",\"\"),\"..... vs \",IF(AN151=J151,\"[b]\",\"\"),AN151,IF(AND(AN151<>\"\",AN151<>\"(Q)\"),VLOOKUP(AN151,$Q$11:$R$200,2,0),\"\"),IF(AN151=J151,\"[/b]\",\"\"),\"..... ( \",IF(AM151=J151,\"[b]\",\"\"),Коэффициенты!F151,IF(AM151=J151,\"[/b]\",\"\"),\" - \",IF(AN151=J151,\"[b]\",\"\"),Коэффициенты!G151,IF(AN151=J151,\"[/b]\",\"\"),\" )\",IF(J151=\"\",$M$13,\"\"))),\"\"),\"\")","v":""},null,null,null,null,null,null,null,null,null,null,{"$f":"IF(Коэффициенты!L151<>\"\",Коэффициенты!L151,\"\")","v":""},null,null,null,null,null,null,null,null,null,null,null,null,null,null,null,null,null,null,null,null,null,null,{"$f":"IF(Коэффициенты!D151<>\"\",Коэффициенты!D151,\"\")","v":""},{"$f":"IF(Коэффициенты!E151<>\"\",Коэффициенты!E151,\"\")","v":""},""]
[null,{"$f":"IF(Коэффициенты!B152<>\"\",Коэффициенты!B152,\"\")","v":""},"",{"$f":"IF(Коэффициенты!C152<>\"\",Коэффициенты!C152,\"\")","v":""},{"$f":"IF(AND(AM152<>\"\",AN152<>\"\"),IF(OR(AM152<>\"\",AN152<>\"\"),IF(AN152=\"bye\",CONCATENATE($M$16,AM152,IF(AND(AM152<>\"\",AM152<>\"(Q)\"),VLOOKUP(AM152,$Q$11:$R$200,2,0),\"\"),\"..... vs \",AN152,$M$17),CONCATENATE(IF(J152=\"\",$M$12,\"\"),IF(AM152=J152,\"[b]\",\"\"),AM152,IF(AND(AM152<>\"\",AM152<>\"(Q)\"),VLOOKUP(AM152,$Q$11:$R$200,2,0),\"\"),IF(AM152=J152,\"[/b]\",\"\"),\"..... vs \",IF(AN152=J152,\"[b]\",\"\"),AN152,IF(AND(AN152<>\"\",AN152<>\"(Q)\"),VLOOKUP(AN152,$Q$11:$R$200,2,0),\"\"),IF(AN152=J152,\"[/b]\",\"\"),\"..... ( \",IF(AM152=J152,\"[b]\",\"\"),Коэффициенты!F152,IF(AM152=J152,\"[/b]\",\"\"),\" - \",IF(AN152=J152,\"[b]\",\"\"),Коэффициенты!G152,IF(AN152=J152,\"[/b]\",\"\"),\" )\",IF(J152=\"\",$M$13,\"\"))),\"\"),\"\")","v":""},null,null,null,null,null,null,null,null,null,null,{"$f":"IF(Коэффициенты!L152<>\"\",Коэффициенты!L152,\"\")","v":""},null,null,null,null,null,null,null,null,null,null,null,null,null,null,null,null,null,null,null,null,null,null,{"$f":"IF(Коэффициенты!D152<>\"\",Коэффициенты!D152,\"\")","v":""},{"$f":"IF(Коэффициенты!E152<>\"\",Коэффициенты!E152,\"\")","v":""},""]
[null,{"$f":"IF(Коэффициенты!B153<>\"\",Коэффициенты!B153,\"\")","v":""},"",{"$f":"IF(Коэффициенты!C153<>\"\",Коэффициенты!C153,\"\")","v":""},{"$f":"IF(AND(AM153<>\"\",AN153<>\"\"),IF(OR(AM153<>\"\",AN153<>\"\"),IF(AN153=\"bye\",CONCATENATE($M$16,AM153,IF(AND(AM153<>\"\",AM153<>\"(Q)\"),VLOOKUP(AM153,$Q$11:$R$200,2,0),\"\"),\"..... vs \",AN153,$M$17),CONCATENATE(IF(J153=\"\",$M$12,\"\"),IF(AM153=J153,\"[b]\",\"\"),AM153,IF(AND(AM153<>\"\",AM153<>\"(Q)\"),VLOOKUP(AM153,$Q$11:$R$200,2,0),\"\"),IF(AM153=J153,\"[/b]\",\"\"),\"..... vs \",IF(AN153=J153,\"[b]\",\"\"),AN153,IF(AND(AN153<>\"\",AN153<>\"(Q)\"),VLOOKUP(AN153,$Q$11:$R$200,2,0),\"\"),IF(AN153=J153,\"[/b]\",\"\"),\"..... ( \",IF(AM153=J153,\"[b]\",\"\"),Коэффициенты!F153,IF(AM153=J153,\"[/b]\",\"\"),\" - \",IF(AN153=J153,\"[b]\",\"\"),Коэффициенты!G153,IF(AN153=J153,\"[/b]\",\"\"),\" )\",IF(J153=\"\",$M$13,\"\"))),\"\"),\"\")","v":""},null,null,null,null,null,null,null,null,null,null,{"$f":"IF(Коэффициенты!L153<>\"\",Коэффициенты!L153,\"\")","v":""},null,null,null,null,null,null,null,null,null,null,null,null,null,null,null,null,null,null,null,null,null,null,{"$f":"IF(Коэффициенты!D153<>\"\",Коэффициенты!D153,\"\")","v":""},{"$f":"IF(Коэффициенты!E153<>\"\",Коэффициенты!E153,\"\")","v":""},""]
[null,{"$f":"IF(Коэффициенты!B154<>\"\",Коэффициенты!B154,\"\")","v":""},"",{"$f":"IF(Коэффициенты!C154<>\"\",Коэффициенты!C154,\"\")","v":""},{"$f":"IF(AND(AM154<>\"\",AN154<>\"\"),IF(OR(AM154<>\"\",AN154<>\"\"),IF(AN154=\"bye\",CONCATENATE($M$16,AM154,IF(AND(AM154<>\"\",AM154<>\"(Q)\"),VLOOKUP(AM154,$Q$11:$R$200,2,0),\"\"),\"..... vs \",AN154,$M$17),CONCATENATE(IF(J154=\"\",$M$12,\"\"),IF(AM154=J154,\"[b]\",\"\"),AM154,IF(AND(AM154<>\"\",AM154<>\"(Q)\"),VLOOKUP(AM154,$Q$11:$R$200,2,0),\"\"),IF(AM154=J154,\"[/b]\",\"\"),\"..... vs \",IF(AN154=J154,\"[b]\",\"\"),AN154,IF(AND(AN154<>\"\",AN154<>\"(Q)\"),VLOOKUP(AN154,$Q$11:$R$200,2,0),\"\"),IF(AN154=J154,\"[/b]\",\"\"),\"..... ( \",IF(AM154=J154,\"[b]\",\"\"),Коэффициенты!F154,IF(AM154=J154,\"[/b]\",\"\"),\" - \",IF(AN154=J154,\"[b]\",\"\"),Коэффициенты!G154,IF(AN154=J154,\"[/b]\",\"\"),\" )\",IF(J154=\"\",$M$13,\"\"))),\"\"),\"\")","v":""},null,null,null,null,null,null,null,null,null,null,{"$f":"IF(Коэффициенты!L154<>\"\",Коэффициенты!L154,\"\")","v":""},null,null,null,null,null,null,null,null,null,null,null,null,null,null,null,null,null,null,null,null,null,null,{"$f":"IF(Коэффициенты!D154<>\"\",Коэффициенты!D154,\"\")","v":""},{"$f":"IF(Коэффициенты!E154<>\"\",Коэффициенты!E154,\"\")","v":""},""]
[null,{"$f":"IF(Коэффициенты!B155<>\"\",Коэффициенты!B155,\"\")","v":""},"",{"$f":"IF(Коэффициенты!C155<>\"\",Коэффициенты!C155,\"\")","v":""},{"$f":"IF(AND(AM155<>\"\",AN155<>\"\"),IF(OR(AM155<>\"\",AN155<>\"\"),IF(AN155=\"bye\",CONCATENATE($M$16,AM155,IF(AND(AM155<>\"\",AM155<>\"(Q)\"),VLOOKUP(AM155,$Q$11:$R$200,2,0),\"\"),\"..... vs \",AN155,$M$17),CONCATENATE(IF(J155=\"\",$M$12,\"\"),IF(AM155=J155,\"[b]\",\"\"),AM155,IF(AND(AM155<>\"\",AM155<>\"(Q)\"),VLOOKUP(AM155,$Q$11:$R$200,2,0),\"\"),IF(AM155=J155,\"[/b]\",\"\"),\"..... vs \",IF(AN155=J155,\"[b]\",\"\"),AN155,IF(AND(AN155<>\"\",AN155<>\"(Q)\"),VLOOKUP(AN155,$Q$11:$R$200,2,0),\"\"),IF(AN155=J155,\"[/b]\",\"\"),\"..... ( \",IF(AM155=J155,\"[b]\",\"\"),Коэффициенты!F155,IF(AM155=J155,\"[/b]\",\"\"),\" - \",IF(AN155=J155,\"[b]\",\"\"),Коэффициенты!G155,IF(AN155=J155,\"[/b]\",\"\"),\" )\",IF(J155=\"\",$M$13,\"\"))),\"\"),\"\")","v":""},null,null,null,null,null,null,null,null,null,null,{"$f":"IF(Коэффициенты!L155<>\"\",Коэффициенты!L155,\"\")","v":""},null,null,null,null,null,null,null,null,null,null,null,null,null,null,null,null,null,null,null,null,null,null,{"$f":"IF(Коэффициенты!D155<>\"\",Коэффициенты!D155,\"\")","v":""},{"$f":"IF(Коэффициенты!E155<>\"\",Коэффициенты!E155,\"\")","v":""},""]
[null,{"$f":"IF(Коэффициенты!B156<>\"\",Коэффициенты!B156,\"\")","v":""},"",{"$f":"IF(Коэффициенты!C156<>\"\",Коэффициенты!C156,\"\")","v":""},{"$f":"IF(AND(AM156<>\"\",AN156<>\"\"),IF(OR(AM156<>\"\",AN156<>\"\"),IF(AN156=\"bye\",CONCATENATE($M$16,AM156,IF(AND(AM156<>\"\",AM156<>\"(Q)\"),VLOOKUP(AM156,$Q$11:$R$200,2,0),\"\"),\"..... vs \",AN156,$M$17),CONCATENATE(IF(J156=\"\",$M$12,\"\"),IF(AM156=J156,\"[b]\",\"\"),AM156,IF(AND(AM156<>\"\",AM156<>\"(Q)\"),VLOOKUP(AM156,$Q$11:$R$200,2,0),\"\"),IF(AM156=J156,\"[/b]\",\"\"),\"..... vs \",IF(AN156=J156,\"[b]\",\"\"),AN156,IF(AND(AN156<>\"\",AN156<>\"(Q)\"),VLOOKUP(AN156,$Q$11:$R$200,2,0),\"\"),IF(AN156=J156,\"[/b]\",\"\"),\"..... ( \",IF(AM156=J156,\"[b]\",\"\"),Коэффициенты!F156,IF(AM156=J156,\"[/b]\",\"\"),\" - \",IF(AN156=J156,\"[b]\",\"\"),Коэффициенты!G156,IF(AN156=J156,\"[/b]\",\"\"),\" )\",IF(J156=\"\",$M$13,\"\"))),\"\"),\"\")","v":""},null,null,null,null,null,null,null,null,null,null,{"$f":"IF(Коэффициенты!L156<>\"\",Коэффициенты!L156,\"\")","v":""},null,null,null,null,null,null,null,null,null,null,null,null,null,null,null,null,null,null,null,null,null,null,{"$f":"IF(Коэффициенты!D156<>\"\",Коэффициенты!D156,\"\")","v":""},{"$f":"IF(Коэффициенты!E156<>\"\",Коэффициенты!E156,\"\")","v":""},""]
[null,{"$f":"IF(Коэффициенты!B157<>\"\",Коэффициенты!B157,\"\")","v":""},"",{"$f":"IF(Коэффициенты!C157<>\"\",Коэффициенты!C157,\"\")","v":""},{"$f":"IF(AND(AM157<>\"\",AN157<>\"\"),IF(OR(AM157<>\"\",AN157<>\"\"),IF(AN157=\"bye\",CONCATENATE($M$16,AM157,IF(AND(AM157<>\"\",AM157<>\"(Q)\"),VLOOKUP(AM157,$Q$11:$R$200,2,0),\"\"),\"..... vs \",AN157,$M$17),CONCATENATE(IF(J157=\"\",$M$12,\"\"),IF(AM157=J157,\"[b]\",\"\"),AM157,IF(AND(AM157<>\"\",AM157<>\"(Q)\"),VLOOKUP(AM157,$Q$11:$R$200,2,0),\"\"),IF(AM157=J157,\"[/b]\",\"\"),\"..... vs \",IF(AN157=J157,\"[b]\",\"\"),AN157,IF(AND(AN157<>\"\",AN157<>\"(Q)\"),VLOOKUP(AN157,$Q$11:$R$200,2,0),\"\"),IF(AN157=J157,\"[/b]\",\"\"),\"..... ( \",IF(AM157=J157,\"[b]\",\"\"),Коэффициенты!F157,IF(AM157=J157,\"[/b]\",\"\"),\" - \",IF(AN157=J157,\"[b]\",\"\"),Коэффициенты!G157,IF(AN157=J157,\"[/b]\",\"\"),\" )\",IF(J157=\"\",$M$13,\"\"))),\"\"),\"\")","v":""},null,null,null,null,null,null,null,null,null,null,{"$f":"IF(Коэффициенты!L157<>\"\",Коэффициенты!L157,\"\")","v":""},null,null,null,null,null,null,null,null,null,null,null,null,null,null,null,null,null,null,null,null,null,null,{"$f":"IF(Коэффициенты!D157<>\"\",Коэффициенты!D157,\"\")","v":""},{"$f":"IF(Коэффициенты!E157<>\"\",Коэффициенты!E157,\"\")","v":""},""]
[null,{"$f":"IF(Коэффициенты!B158<>\"\",Коэффициенты!B158,\"\")","v":""},"",{"$f":"IF(Коэффициенты!C158<>\"\",Коэффициенты!C158,\"\")","v":""},{"$f":"IF(AND(AM158<>\"\",AN158<>\"\"),IF(OR(AM158<>\"\",AN158<>\"\"),IF(AN158=\"bye\",CONCATENATE($M$16,AM158,IF(AND(AM158<>\"\",AM158<>\"(Q)\"),VLOOKUP(AM158,$Q$11:$R$200,2,0),\"\"),\"..... vs \",AN158,$M$17),CONCATENATE(IF(J158=\"\",$M$12,\"\"),IF(AM158=J158,\"[b]\",\"\"),AM158,IF(AND(AM158<>\"\",AM158<>\"(Q)\"),VLOOKUP(AM158,$Q$11:$R$200,2,0),\"\"),IF(AM158=J158,\"[/b]\",\"\"),\"..... vs \",IF(AN158=J158,\"[b]\",\"\"),AN158,IF(AND(AN158<>\"\",AN158<>\"(Q)\"),VLOOKUP(AN158,$Q$11:$R$200,2,0),\"\"),IF(AN158=J158,\"[/b]\",\"\"),\"..... ( \",IF(AM158=J158,\"[b]\",\"\"),Коэффициенты!F158,IF(AM158=J158,\"[/b]\",\"\"),\" - \",IF(AN158=J158,\"[b]\",\"\"),Коэффициенты!G158,IF(AN158=J158,\"[/b]\",\"\"),\" )\",IF(J158=\"\",$M$13,\"\"))),\"\"),\"\")","v":""},null,null,null,null,null,null,null,null,null,null,{"$f":"IF(Коэффициенты!L158<>\"\",Коэффициенты!L158,\"\")","v":""},null,null,null,null,null,null,null,null,null,null,null,null,null,null,null,null,null,null,null,null,null,null,{"$f":"IF(Коэффициенты!D158<>\"\",Коэффициенты!D158,\"\")","v":""},{"$f":"IF(Коэффициенты!E158<>\"\",Коэффициенты!E158,\"\")","v":""},""]
[null,{"$f":"IF(Коэффициенты!B159<>\"\",Коэффициенты!B159,\"\")","v":""},"",{"$f":"IF(Коэффициенты!C159<>\"\",Коэффициенты!C159,\"\")","v":""},{"$f":"IF(AND(AM159<>\"\",AN159<>\"\"),IF(OR(AM159<>\"\",AN159<>\"\"),IF(AN159=\"bye\",CONCATENATE($M$16,AM159,IF(AND(AM159<>\"\",AM159<>\"(Q)\"),VLOOKUP(AM159,$Q$11:$R$200,2,0),\"\"),\"..... vs \",AN159,$M$17),CONCATENATE(IF(J159=\"\",$M$12,\"\"),IF(AM159=J159,\"[b]\",\"\"),AM159,IF(AND(AM159<>\"\",AM159<>\"(Q)\"),VLOOKUP(AM159,$Q$11:$R$200,2,0),\"\"),IF(AM159=J159,\"[/b]\",\"\"),\"..... vs \",IF(AN159=J159,\"[b]\",\"\"),AN159,IF(AND(AN159<>\"\",AN159<>\"(Q)\"),VLOOKUP(AN159,$Q$11:$R$200,2,0),\"\"),IF(AN159=J159,\"[/b]\",\"\"),\"..... ( \",IF(AM159=J159,\"[b]\",\"\"),Коэффициенты!F159,IF(AM159=J159,\"[/b]\",\"\"),\" - \",IF(AN159=J159,\"[b]\",\"\"),Коэффициенты!G159,IF(AN159=J159,\"[/b]\",\"\"),\" )\",IF(J159=\"\",$M$13,\"\"))),\"\"),\"\")","v":""},null,null,null,null,null,null,null,null,null,null,{"$f":"IF(Коэффициенты!L159<>\"\",Коэффициенты!L159,\"\")","v":""},null,null,null,null,null,null,null,null,null,null,null,null,null,null,null,null,null,null,null,null,null,null,{"$f":"IF(Коэффициенты!D159<>\"\",Коэффициенты!D159,\"\")","v":""},{"$f":"IF(Коэффициенты!E159<>\"\",Коэффициенты!E159,\"\")","v":""},""]
[null,{"$f":"IF(Коэффициенты!B160<>\"\",Коэффициенты!B160,\"\")","v":""},"",{"$f":"IF(Коэффициенты!C160<>\"\",Коэффициенты!C160,\"\")","v":""},{"$f":"IF(AND(AM160<>\"\",AN160<>\"\"),IF(OR(AM160<>\"\",AN160<>\"\"),IF(AN160=\"bye\",CONCATENATE($M$16,AM160,IF(AND(AM160<>\"\",AM160<>\"(Q)\"),VLOOKUP(AM160,$Q$11:$R$200,2,0),\"\"),\"..... vs \",AN160,$M$17),CONCATENATE(IF(J160=\"\",$M$12,\"\"),IF(AM160=J160,\"[b]\",\"\"),AM160,IF(AND(AM160<>\"\",AM160<>\"(Q)\"),VLOOKUP(AM160,$Q$11:$R$200,2,0),\"\"),IF(AM160=J160,\"[/b]\",\"\"),\"..... vs \",IF(AN160=J160,\"[b]\",\"\"),AN160,IF(AND(AN160<>\"\",AN160<>\"(Q)\"),VLOOKUP(AN160,$Q$11:$R$200,2,0),\"\"),IF(AN160=J160,\"[/b]\",\"\"),\"..... ( \",IF(AM160=J160,\"[b]\",\"\"),Коэффициенты!F160,IF(AM160=J160,\"[/b]\",\"\"),\" - \",IF(AN160=J160,\"[b]\",\"\"),Коэффициенты!G160,IF(AN160=J160,\"[/b]\",\"\"),\" )\",IF(J160=\"\",$M$13,\"\"))),\"\"),\"\")","v":""},null,null,null,null,null,null,null,null,null,null,{"$f":"IF(Коэффициенты!L160<>\"\",Коэффициенты!L160,\"\")","v":""},null,null,null,null,null,null,null,null,null,null,null,null,null,null,null,null,null,null,null,null,null,null,{"$f":"IF(Коэффициенты!D160<>\"\",Коэффициенты!D160,\"\")","v":""},{"$f":"IF(Коэффициенты!E160<>\"\",Коэффициенты!E160,\"\")","v":""},""]
[null,{"$f":"IF(Коэффициенты!B161<>\"\",Коэффициенты!B161,\"\")","v":""},"",{"$f":"IF(Коэффициенты!C161<>\"\",Коэффициенты!C161,\"\")","v":""},{"$f":"IF(AND(AM161<>\"\",AN161<>\"\"),IF(OR(AM161<>\"\",AN161<>\"\"),IF(AN161=\"bye\",CONCATENATE($M$16,AM161,IF(AND(AM161<>\"\",AM161<>\"(Q)\"),VLOOKUP(AM161,$Q$11:$R$200,2,0),\"\"),\"..... vs \",AN161,$M$17),CONCATENATE(IF(J161=\"\",$M$12,\"\"),IF(AM161=J161,\"[b]\",\"\"),AM161,IF(AND(AM161<>\"\",AM161<>\"(Q)\"),VLOOKUP(AM161,$Q$11:$R$200,2,0),\"\"),IF(AM161=J161,\"[/b]\",\"\"),\"..... vs \",IF(AN161=J161,\"[b]\",\"\"),AN161,IF(AND(AN161<>\"\",AN161<>\"(Q)\"),VLOOKUP(AN161,$Q$11:$R$200,2,0),\"\"),IF(AN161=J161,\"[/b]\",\"\"),\"..... ( \",IF(AM161=J161,\"[b]\",\"\"),Коэффициенты!F161,IF(AM161=J161,\"[/b]\",\"\"),\" - \",IF(AN161=J161,\"[b]\",\"\"),Коэффициенты!G161,IF(AN161=J161,\"[/b]\",\"\"),\" )\",IF(J161=\"\",$M$13,\"\"))),\"\"),\"\")","v":""},null,null,null,null,null,null,null,null,null,null,{"$f":"IF(Коэффициенты!L161<>\"\",Коэффициенты!L161,\"\")","v":""},null,null,null,null,null,null,null,null,null,null,null,null,null,null,null,null,null,null,null,null,null,null,{"$f":"IF(Коэффициенты!D161<>\"\",Коэффициенты!D161,\"\")","v":""},{"$f":"IF(Коэффициенты!E161<>\"\",Коэффициенты!E161,\"\")","v":""},""]
[null,{"$f":"IF(Коэффициенты!B162<>\"\",Коэффициенты!B162,\"\")","v":""},"",{"$f":"IF(Коэффициенты!C162<>\"\",Коэффициенты!C162,\"\")","v":""},{"$f":"IF(AND(AM162<>\"\",AN162<>\"\"),IF(OR(AM162<>\"\",AN162<>\"\"),IF(AN162=\"bye\",CONCATENATE($M$16,AM162,IF(AND(AM162<>\"\",AM162<>\"(Q)\"),VLOOKUP(AM162,$Q$11:$R$200,2,0),\"\"),\"..... vs \",AN162,$M$17),CONCATENATE(IF(J162=\"\",$M$12,\"\"),IF(AM162=J162,\"[b]\",\"\"),AM162,IF(AND(AM162<>\"\",AM162<>\"(Q)\"),VLOOKUP(AM162,$Q$11:$R$200,2,0),\"\"),IF(AM162=J162,\"[/b]\",\"\"),\"..... vs \",IF(AN162=J162,\"[b]\",\"\"),AN162,IF(AND(AN162<>\"\",AN162<>\"(Q)\"),VLOOKUP(AN162,$Q$11:$R$200,2,0),\"\"),IF(AN162=J162,\"[/b]\",\"\"),\"..... ( \",IF(AM162=J162,\"[b]\",\"\"),Коэффициенты!F162,IF(AM162=J162,\"[/b]\",\"\"),\" - \",IF(AN162=J162,\"[b]\",\"\"),Коэффициенты!G162,IF(AN162=J162,\"[/b]\",\"\"),\" )\",IF(J162=\"\",$M$13,\"\"))),\"\"),\"\")","v":""},null,null,null,null,null,null,null,null,null,null,{"$f":"IF(Коэффициенты!L162<>\"\",Коэффициенты!L162,\"\")","v":""},null,null,null,null,null,null,null,null,null,null,null,null,null,null,null,null,null,null,null,null,null,null,{"$f":"IF(Коэффициенты!D162<>\"\",Коэффициенты!D162,\"\")","v":""},{"$f":"IF(Коэффициенты!E162<>\"\",Коэффициенты!E162,\"\")","v":""},""]
[null,{"$f":"IF(Коэффициенты!B163<>\"\",Коэффициенты!B163,\"\")","v":""},"",{"$f":"IF(Коэффициенты!C163<>\"\",Коэффициенты!C163,\"\")","v":""},{"$f":"IF(AND(AM163<>\"\",AN163<>\"\"),IF(OR(AM163<>\"\",AN163<>\"\"),IF(AN163=\"bye\",CONCATENATE($M$16,AM163,IF(AND(AM163<>\"\",AM163<>\"(Q)\"),VLOOKUP(AM163,$Q$11:$R$200,2,0),\"\"),\"..... vs \",AN163,$M$17),CONCATENATE(IF(J163=\"\",$M$12,\"\"),IF(AM163=J163,\"[b]\",\"\"),AM163,IF(AND(AM163<>\"\",AM163<>\"(Q)\"),VLOOKUP(AM163,$Q$11:$R$200,2,0),\"\"),IF(AM163=J163,\"[/b]\",\"\"),\"..... vs \",IF(AN163=J163,\"[b]\",\"\"),AN163,IF(AND(AN163<>\"\",AN163<>\"(Q)\"),VLOOKUP(AN163,$Q$11:$R$200,2,0),\"\"),IF(AN163=J163,\"[/b]\",\"\"),\"..... ( \",IF(AM163=J163,\"[b]\",\"\"),Коэффициенты!F163,IF(AM163=J163,\"[/b]\",\"\"),\" - \",IF(AN163=J163,\"[b]\",\"\"),Коэффициенты!G163,IF(AN163=J163,\"[/b]\",\"\"),\" )\",IF(J163=\"\",$M$13,\"\"))),\"\"),\"\")","v":""},null,null,null,null,null,null,null,null,null,null,{"$f":"IF(Коэффициенты!L163<>\"\",Коэффициенты!L163,\"\")","v":""},null,null,null,null,null,null,null,null,null,null,null,null,null,null,null,null,null,null,null,null,null,null,{"$f":"IF(Коэффициенты!D163<>\"\",Коэффициенты!D163,\"\")","v":""},{"$f":"IF(Коэффициенты!E163<>\"\",Коэффициенты!E163,\"\")","v":""},""]
[null,{"$f":"IF(Коэффициенты!B164<>\"\",Коэффициенты!B164,\"\")","v":""},"",{"$f":"IF(Коэффициенты!C164<>\"\",Коэффициенты!C164,\"\")","v":""},{"$f":"IF(AND(AM164<>\"\",AN164<>\"\"),IF(OR(AM164<>\"\",AN164<>\"\"),IF(AN164=\"bye\",CONCATENATE($M$16,AM164,IF(AND(AM164<>\"\",AM164<>\"(Q)\"),VLOOKUP(AM164,$Q$11:$R$200,2,0),\"\"),\"..... vs \",AN164,$M$17),CONCATENATE(IF(J164=\"\",$M$12,\"\"),IF(AM164=J164,\"[b]\",\"\"),AM164,IF(AND(AM164<>\"\",AM164<>\"(Q)\"),VLOOKUP(AM164,$Q$11:$R$200,2,0),\"\"),IF(AM164=J164,\"[/b]\",\"\"),\"..... vs \",IF(AN164=J164,\"[b]\",\"\"),AN164,IF(AND(AN164<>\"\",AN164<>\"(Q)\"),VLOOKUP(AN164,$Q$11:$R$200,2,0),\"\"),IF(AN164=J164,\"[/b]\",\"\"),\"..... ( \",IF(AM164=J164,\"[b]\",\"\"),Коэффициенты!F164,IF(AM164=J164,\"[/b]\",\"\"),\" - \",IF(AN164=J164,\"[b]\",\"\"),Коэффициенты!G164,IF(AN164=J164,\"[/b]\",\"\"),\" )\",IF(J164=\"\",$M$13,\"\"))),\"\"),\"\")","v":""},null,null,null,null,null,null,null,null,null,null,{"$f":"IF(Коэффициенты!L164<>\"\",Коэффициенты!L164,\"\")","v":""},null,null,null,null,null,null,null,null,null,null,null,null,null,null,null,null,null,null,null,null,null,null,{"$f":"IF(Коэффициенты!D164<>\"\",Коэффициенты!D164,\"\")","v":""},{"$f":"IF(Коэффициенты!E164<>\"\",Коэффициенты!E164,\"\")","v":""},""]
[null,{"$f":"IF(Коэффициенты!B165<>\"\",Коэффициенты!B165,\"\")","v":""},"",{"$f":"IF(Коэффициенты!C165<>\"\",Коэффициенты!C165,\"\")","v":""},{"$f":"IF(AND(AM165<>\"\",AN165<>\"\"),IF(OR(AM165<>\"\",AN165<>\"\"),IF(AN165=\"bye\",CONCATENATE($M$16,AM165,IF(AND(AM165<>\"\",AM165<>\"(Q)\"),VLOOKUP(AM165,$Q$11:$R$200,2,0),\"\"),\"..... vs \",AN165,$M$17),CONCATENATE(IF(J165=\"\",$M$12,\"\"),IF(AM165=J165,\"[b]\",\"\"),AM165,IF(AND(AM165<>\"\",AM165<>\"(Q)\"),VLOOKUP(AM165,$Q$11:$R$200,2,0),\"\"),IF(AM165=J165,\"[/b]\",\"\"),\"..... vs \",IF(AN165=J165,\"[b]\",\"\"),AN165,IF(AND(AN165<>\"\",AN165<>\"(Q)\"),VLOOKUP(AN165,$Q$11:$R$200,2,0),\"\"),IF(AN165=J165,\"[/b]\",\"\"),\"..... ( \",IF(AM165=J165,\"[b]\",\"\"),Коэффициенты!F165,IF(AM165=J165,\"[/b]\",\"\"),\" - \",IF(AN165=J165,\"[b]\",\"\"),Коэффициенты!G165,IF(AN165=J165,\"[/b]\",\"\"),\" )\",IF(J165=\"\",$M$13,\"\"))),\"\"),\"\")","v":""},null,null,null,null,null,null,null,null,null,null,{"$f":"IF(Коэффициенты!L165<>\"\",Коэффициенты!L165,\"\")","v":""},null,null,null,null,null,null,null,null,null,null,null,null,null,null,null,null,null,null,null,null,null,null,{"$f":"IF(Коэффициенты!D165<>\"\",Коэффициенты!D165,\"\")","v":""},{"$f":"IF(Коэффициенты!E165<>\"\",Коэффициенты!E165,\"\")","v":""},""]
[null,{"$f":"IF(Коэффициенты!B166<>\"\",Коэффициенты!B166,\"\")","v":""},"",{"$f":"IF(Коэффициенты!C166<>\"\",Коэффициенты!C166,\"\")","v":""},{"$f":"IF(AND(AM166<>\"\",AN166<>\"\"),IF(OR(AM166<>\"\",AN166<>\"\"),IF(AN166=\"bye\",CONCATENATE($M$16,AM166,IF(AND(AM166<>\"\",AM166<>\"(Q)\"),VLOOKUP(AM166,$Q$11:$R$200,2,0),\"\"),\"..... vs \",AN166,$M$17),CONCATENATE(IF(J166=\"\",$M$12,\"\"),IF(AM166=J166,\"[b]\",\"\"),AM166,IF(AND(AM166<>\"\",AM166<>\"(Q)\"),VLOOKUP(AM166,$Q$11:$R$200,2,0),\"\"),IF(AM166=J166,\"[/b]\",\"\"),\"..... vs \",IF(AN166=J166,\"[b]\",\"\"),AN166,IF(AND(AN166<>\"\",AN166<>\"(Q)\"),VLOOKUP(AN166,$Q$11:$R$200,2,0),\"\"),IF(AN166=J166,\"[/b]\",\"\"),\"..... ( \",IF(AM166=J166,\"[b]\",\"\"),Коэффициенты!F166,IF(AM166=J166,\"[/b]\",\"\"),\" - \",IF(AN166=J166,\"[b]\",\"\"),Коэффициенты!G166,IF(AN166=J166,\"[/b]\",\"\"),\" )\",IF(J166=\"\",$M$13,\"\"))),\"\"),\"\")","v":""},null,null,null,null,null,null,null,null,null,null,{"$f":"IF(Коэффициенты!L166<>\"\",Коэффициенты!L166,\"\")","v":""},null,null,null,null,null,null,null,null,null,null,null,null,null,null,null,null,null,null,null,null,null,null,{"$f":"IF(Коэффициенты!D166<>\"\",Коэффициенты!D166,\"\")","v":""},{"$f":"IF(Коэффициенты!E166<>\"\",Коэффициенты!E166,\"\")","v":""},""]
[null,{"$f":"IF(Коэффициенты!B167<>\"\",Коэффициенты!B167,\"\")","v":""},"",{"$f":"IF(Коэффициенты!C167<>\"\",Коэффициенты!C167,\"\")","v":""},{"$f":"IF(AND(AM167<>\"\",AN167<>\"\"),IF(OR(AM167<>\"\",AN167<>\"\"),IF(AN167=\"bye\",CONCATENATE($M$16,AM167,IF(AND(AM167<>\"\",AM167<>\"(Q)\"),VLOOKUP(AM167,$Q$11:$R$200,2,0),\"\"),\"..... vs \",AN167,$M$17),CONCATENATE(IF(J167=\"\",$M$12,\"\"),IF(AM167=J167,\"[b]\",\"\"),AM167,IF(AND(AM167<>\"\",AM167<>\"(Q)\"),VLOOKUP(AM167,$Q$11:$R$200,2,0),\"\"),IF(AM167=J167,\"[/b]\",\"\"),\"..... vs \",IF(AN167=J167,\"[b]\",\"\"),AN167,IF(AND(AN167<>\"\",AN167<>\"(Q)\"),VLOOKUP(AN167,$Q$11:$R$200,2,0),\"\"),IF(AN167=J167,\"[/b]\",\"\"),\"..... ( \",IF(AM167=J167,\"[b]\",\"\"),Коэффициенты!F167,IF(AM167=J167,\"[/b]\",\"\"),\" - \",IF(AN167=J167,\"[b]\",\"\"),Коэффициенты!G167,IF(AN167=J167,\"[/b]\",\"\"),\" )\",IF(J167=\"\",$M$13,\"\"))),\"\"),\"\")","v":""},null,null,null,null,null,null,null,null,null,null,{"$f":"IF(Коэффициенты!L167<>\"\",Коэффициенты!L167,\"\")","v":""},null,null,null,null,null,null,null,null,null,null,null,null,null,null,null,null,null,null,null,null,null,null,{"$f":"IF(Коэффициенты!D167<>\"\",Коэффициенты!D167,\"\")","v":""},{"$f":"IF(Коэффициенты!E167<>\"\",Коэффициенты!E167,\"\")","v":""},""]
[null,{"$f":"IF(Коэффициенты!B168<>\"\",Коэффициенты!B168,\"\")","v":""},"",{"$f":"IF(Коэффициенты!C168<>\"\",Коэффициенты!C168,\"\")","v":""},{"$f":"IF(AND(AM168<>\"\",AN168<>\"\"),IF(OR(AM168<>\"\",AN168<>\"\"),IF(AN168=\"bye\",CONCATENATE($M$16,AM168,IF(AND(AM168<>\"\",AM168<>\"(Q)\"),VLOOKUP(AM168,$Q$11:$R$200,2,0),\"\"),\"..... vs \",AN168,$M$17),CONCATENATE(IF(J168=\"\",$M$12,\"\"),IF(AM168=J168,\"[b]\",\"\"),AM168,IF(AND(AM168<>\"\",AM168<>\"(Q)\"),VLOOKUP(AM168,$Q$11:$R$200,2,0),\"\"),IF(AM168=J168,\"[/b]\",\"\"),\"..... vs \",IF(AN168=J168,\"[b]\",\"\"),AN168,IF(AND(AN168<>\"\",AN168<>\"(Q)\"),VLOOKUP(AN168,$Q$11:$R$200,2,0),\"\"),IF(AN168=J168,\"[/b]\",\"\"),\"..... ( \",IF(AM168=J168,\"[b]\",\"\"),Коэффициенты!F168,IF(AM168=J168,\"[/b]\",\"\"),\" - \",IF(AN168=J168,\"[b]\",\"\"),Коэффициенты!G168,IF(AN168=J168,\"[/b]\",\"\"),\" )\",IF(J168=\"\",$M$13,\"\"))),\"\"),\"\")","v":""},null,null,null,null,null,null,null,null,null,null,{"$f":"IF(Коэффициенты!L168<>\"\",Коэффициенты!L168,\"\")","v":""},{"$f":"IF(Коэффициенты!M149<>\"\",Коэффициенты!M149,\"\")","v":""},null,null,null,null,null,null,null,null,null,null,null,null,null,null,null,null,null,null,null,null,null,{"$f":"IF(Коэффициенты!D168<>\"\",Коэффициенты!D168,\"\")","v":""},{"$f":"IF(Коэффициенты!E168<>\"\",Коэффициенты!E168,\"\")","v":""},""]
[null,{"$f":"IF(Коэффициенты!B169<>\"\",Коэффициенты!B169,\"\")","v":""},"",{"$f":"IF(Коэффициенты!C169<>\"\",Коэффициенты!C169,\"\")","v":""},{"$f":"IF(AND(AM169<>\"\",AN169<>\"\"),IF(OR(AM169<>\"\",AN169<>\"\"),IF(AN169=\"bye\",CONCATENATE($M$16,AM169,IF(AND(AM169<>\"\",AM169<>\"(Q)\"),VLOOKUP(AM169,$Q$11:$R$200,2,0),\"\"),\"..... vs \",AN169,$M$17),CONCATENATE(IF(J169=\"\",$M$12,\"\"),IF(AM169=J169,\"[b]\",\"\"),AM169,IF(AND(AM169<>\"\",AM169<>\"(Q)\"),VLOOKUP(AM169,$Q$11:$R$200,2,0),\"\"),IF(AM169=J169,\"[/b]\",\"\"),\"..... vs \",IF(AN169=J169,\"[b]\",\"\"),AN169,IF(AND(AN169<>\"\",AN169<>\"(Q)\"),VLOOKUP(AN169,$Q$11:$R$200,2,0),\"\"),IF(AN169=J169,\"[/b]\",\"\"),\"..... ( \",IF(AM169=J169,\"[b]\",\"\"),Коэффициенты!F169,IF(AM169=J169,\"[/b]\",\"\"),\" - \",IF(AN169=J169,\"[b]\",\"\"),Коэффициенты!G169,IF(AN169=J169,\"[/b]\",\"\"),\" )\",IF(J169=\"\",$M$13,\"\"))),\"\"),\"\")","v":""},null,null,null,null,null,null,null,null,null,null,{"$f":"IF(Коэффициенты!L169<>\"\",Коэффициенты!L169,\"\")","v":""},{"$f":"IF(Коэффициенты!M150<>\"\",Коэффициенты!M150,\"\")","v":""},null,null,null,null,null,null,null,null,null,null,null,null,null,null,null,null,null,null,null,null,null,{"$f":"IF(Коэффициенты!D169<>\"\",Коэффициенты!D169,\"\")","v":""},{"$f":"IF(Коэффициенты!E169<>\"\",Коэффициенты!E169,\"\")","v":""},""]
[null,{"$f":"IF(Коэффициенты!B170<>\"\",Коэффициенты!B170,\"\")","v":""},"",{"$f":"IF(Коэффициенты!C170<>\"\",Коэффициенты!C170,\"\")","v":""},{"$f":"IF(AND(AM170<>\"\",AN170<>\"\"),IF(OR(AM170<>\"\",AN170<>\"\"),IF(AN170=\"bye\",CONCATENATE($M$16,AM170,IF(AND(AM170<>\"\",AM170<>\"(Q)\"),VLOOKUP(AM170,$Q$11:$R$200,2,0),\"\"),\"..... vs \",AN170,$M$17),CONCATENATE(IF(J170=\"\",$M$12,\"\"),IF(AM170=J170,\"[b]\",\"\"),AM170,IF(AND(AM170<>\"\",AM170<>\"(Q)\"),VLOOKUP(AM170,$Q$11:$R$200,2,0),\"\"),IF(AM170=J170,\"[/b]\",\"\"),\"..... vs \",IF(AN170=J170,\"[b]\",\"\"),AN170,IF(AND(AN170<>\"\",AN170<>\"(Q)\"),VLOOKUP(AN170,$Q$11:$R$200,2,0),\"\"),IF(AN170=J170,\"[/b]\",\"\"),\"..... ( \",IF(AM170=J170,\"[b]\",\"\"),Коэффициенты!F170,IF(AM170=J170,\"[/b]\",\"\"),\" - \",IF(AN170=J170,\"[b]\",\"\"),Коэффициенты!G170,IF(AN170=J170,\"[/b]\",\"\"),\" )\",IF(J170=\"\",$M$13,\"\"))),\"\"),\"\")","v":""},null,null,null,null,null,null,null,null,null,null,{"$f":"IF(Коэффициенты!L170<>\"\",Коэффициенты!L170,\"\")","v":""},{"$f":"IF(Коэффициенты!M151<>\"\",Коэффициенты!M151,\"\")","v":""},null,null,null,null,null,null,null,null,null,null,null,null,null,null,null,null,null,null,null,null,null,{"$f":"IF(Коэффициенты!D170<>\"\",Коэффициенты!D170,\"\")","v":""},{"$f":"IF(Коэффициенты!E170<>\"\",Коэффициенты!E170,\"\")","v":""},""]
[null,{"$f":"IF(Коэффициенты!B171<>\"\",Коэффициенты!B171,\"\")","v":""},{"$f":"IF(B171<>\"\",CONCATENATE($M$20,B171,$M$21),\"\")","v":""},{"$f":"IF(Коэффициенты!C171<>\"\",Коэффициенты!C171,\"\")","v":""},{"$f":"IF(AND(AM171<>\"\",AN171<>\"\"),IF(OR(AM171<>\"\",AN171<>\"\"),IF(AN171=\"bye\",CONCATENATE($M$16,AM171,IF(AND(AM171<>\"\",AM171<>\"(Q)\"),VLOOKUP(AM171,$Q$11:$R$200,2,0),\"\"),\"..... vs \",AN171,$M$17),CONCATENATE(IF(J171=\"\",$M$12,\"\"),IF(AM171=J171,\"[b]\",\"\"),AM171,IF(AND(AM171<>\"\",AM171<>\"(Q)\"),VLOOKUP(AM171,$Q$11:$R$200,2,0),\"\"),IF(AM171=J171,\"[/b]\",\"\"),\"..... vs \",IF(AN171=J171,\"[b]\",\"\"),AN171,IF(AND(AN171<>\"\",AN171<>\"(Q)\"),VLOOKUP(AN171,$Q$11:$R$200,2,0),\"\"),IF(AN171=J171,\"[/b]\",\"\"),\"..... ( \",IF(AM171=J171,\"[b]\",\"\"),Коэффициенты!F171,IF(AM171=J171,\"[/b]\",\"\"),\" - \",IF(AN171=J171,\"[b]\",\"\"),Коэффициенты!G171,IF(AN171=J171,\"[/b]\",\"\"),\" )\",IF(J171=\"\",$M$13,\"\"))),\"\"),\"\")","v":""},null,null,null,null,null,null,null,null,null,null,{"$f":"IF(Коэффициенты!L171<>\"\",Коэффициенты!L171,\"\")","v":""},{"$f":"IF(Коэффициенты!M152<>\"\",Коэффициенты!M152,\"\")","v":""},null,null,null,null,null,null,null,null,null,null,null,null,null,null,null,null,null,null,null,null,null,{"$f":"IF(Коэффициенты!D171<>\"\",Коэффициенты!D171,\"\")","v":""},{"$f":"IF(Коэффициенты!E171<>\"\",Коэффициенты!E171,\"\")","v":""},""]
[null,{"$f":"IF(Коэффициенты!B172<>\"\",Коэффициенты!B172,\"\")","v":""},"",{"$f":"IF(Коэффициенты!C172<>\"\",Коэффициенты!C172,\"\")","v":""},{"$f":"IF(AND(AM172<>\"\",AN172<>\"\"),IF(OR(AM172<>\"\",AN172<>\"\"),IF(AN172=\"bye\",CONCATENATE($M$16,AM172,IF(AND(AM172<>\"\",AM172<>\"(Q)\"),VLOOKUP(AM172,$Q$11:$R$200,2,0),\"\"),\"..... vs \",AN172,$M$17),CONCATENATE(IF(J172=\"\",$M$12,\"\"),IF(AM172=J172,\"[b]\",\"\"),AM172,IF(AND(AM172<>\"\",AM172<>\"(Q)\"),VLOOKUP(AM172,$Q$11:$R$200,2,0),\"\"),IF(AM172=J172,\"[/b]\",\"\"),\"..... vs \",IF(AN172=J172,\"[b]\",\"\"),AN172,IF(AND(AN172<>\"\",AN172<>\"(Q)\"),VLOOKUP(AN172,$Q$11:$R$200,2,0),\"\"),IF(AN172=J172,\"[/b]\",\"\"),\"..... ( \",IF(AM172=J172,\"[b]\",\"\"),Коэффициенты!F172,IF(AM172=J172,\"[/b]\",\"\"),\" - \",IF(AN172=J172,\"[b]\",\"\"),Коэффициенты!G172,IF(AN172=J172,\"[/b]\",\"\"),\" )\",IF(J172=\"\",$M$13,\"\"))),\"\"),\"\")","v":""},null,null,null,null,null,null,null,null,null,null,{"$f":"IF(Коэффициенты!L172<>\"\",Коэффициенты!L172,\"\")","v":""},{"$f":"IF(Коэффициенты!M153<>\"\",Коэффициенты!M153,\"\")","v":""},null,null,null,null,null,null,null,null,null,null,null,null,null,null,null,null,null,null,null,null,null,{"$f":"IF(Коэффициенты!D172<>\"\",Коэффициенты!D172,\"\")","v":""},{"$f":"IF(Коэффициенты!E172<>\"\",Коэффициенты!E172,\"\")","v":""},""]
[null,{"$f":"IF(Коэффициенты!B173<>\"\",Коэффициенты!B173,\"\")","v":""},"",{"$f":"IF(Коэффициенты!C173<>\"\",Коэффициенты!C173,\"\")","v":""},{"$f":"IF(AND(AM173<>\"\",AN173<>\"\"),IF(OR(AM173<>\"\",AN173<>\"\"),IF(AN173=\"bye\",CONCATENATE($M$16,AM173,IF(AND(AM173<>\"\",AM173<>\"(Q)\"),VLOOKUP(AM173,$Q$11:$R$200,2,0),\"\"),\"..... vs \",AN173,$M$17),CONCATENATE(IF(J173=\"\",$M$12,\"\"),IF(AM173=J173,\"[b]\",\"\"),AM173,IF(AND(AM173<>\"\",AM173<>\"(Q)\"),VLOOKUP(AM173,$Q$11:$R$200,2,0),\"\"),IF(AM173=J173,\"[/b]\",\"\"),\"..... vs \",IF(AN173=J173,\"[b]\",\"\"),AN173,IF(AND(AN173<>\"\",AN173<>\"(Q)\"),VLOOKUP(AN173,$Q$11:$R$200,2,0),\"\"),IF(AN173=J173,\"[/b]\",\"\"),\"..... ( \",IF(AM173=J173,\"[b]\",\"\"),Коэффициенты!F173,IF(AM173=J173,\"[/b]\",\"\"),\" - \",IF(AN173=J173,\"[b]\",\"\"),Коэффициенты!G173,IF(AN173=J173,\"[/b]\",\"\"),\" )\",IF(J173=\"\",$M$13,\"\"))),\"\"),\"\")","v":""},null,null,null,null,null,null,null,null,null,null,{"$f":"IF(Коэффициенты!L173<>\"\",Коэффициенты!L173,\"\")","v":""},{"$f":"IF(Коэффициенты!M154<>\"\",Коэффициенты!M154,\"\")","v":""},null,null,null,null,null,null,null,null,null,null,null,null,null,null,null,null,null,null,null,null,null,{"$f":"IF(Коэффициенты!D173<>\"\",Коэффициенты!D173,\"\")","v":""},{"$f":"IF(Коэффициенты!E173<>\"\",Коэффициенты!E173,\"\")","v":""},""]
[null,{"$f":"IF(Коэффициенты!B174<>\"\",Коэффициенты!B174,\"\")","v":""},"",{"$f":"IF(Коэффициенты!C174<>\"\",Коэффициенты!C174,\"\")","v":""},{"$f":"IF(AND(AM174<>\"\",AN174<>\"\"),IF(OR(AM174<>\"\",AN174<>\"\"),IF(AN174=\"bye\",CONCATENATE($M$16,AM174,IF(AND(AM174<>\"\",AM174<>\"(Q)\"),VLOOKUP(AM174,$Q$11:$R$200,2,0),\"\"),\"..... vs \",AN174,$M$17),CONCATENATE(IF(J174=\"\",$M$12,\"\"),IF(AM174=J174,\"[b]\",\"\"),AM174,IF(AND(AM174<>\"\",AM174<>\"(Q)\"),VLOOKUP(AM174,$Q$11:$R$200,2,0),\"\"),IF(AM174=J174,\"[/b]\",\"\"),\"..... vs \",IF(AN174=J174,\"[b]\",\"\"),AN174,IF(AND(AN174<>\"\",AN174<>\"(Q)\"),VLOOKUP(AN174,$Q$11:$R$200,2,0),\"\"),IF(AN174=J174,\"[/b]\",\"\"),\"..... ( \",IF(AM174=J174,\"[b]\",\"\"),Коэффициенты!F174,IF(AM174=J174,\"[/b]\",\"\"),\" - \",IF(AN174=J174,\"[b]\",\"\"),Коэффициенты!G174,IF(AN174=J174,\"[/b]\",\"\"),\" )\",IF(J174=\"\",$M$13,\"\"))),\"\"),\"\")","v":""},null,null,null,null,null,null,null,null,null,null,{"$f":"IF(Коэффициенты!L174<>\"\",Коэффициенты!L174,\"\")","v":""},{"$f":"IF(Коэффициенты!M155<>\"\",Коэффициенты!M155,\"\")","v":""},null,null,null,null,null,null,null,null,null,null,null,null,null,null,null,null,null,null,null,null,null,{"$f":"IF(Коэффициенты!D174<>\"\",Коэффициенты!D174,\"\")","v":""},{"$f":"IF(Коэффициенты!E174<>\"\",Коэффициенты!E174,\"\")","v":""},""]
[null,{"$f":"IF(Коэффициенты!B175<>\"\",Коэффициенты!B175,\"\")","v":""},"",{"$f":"IF(Коэффициенты!C175<>\"\",Коэффициенты!C175,\"\")","v":""},{"$f":"IF(AND(AM175<>\"\",AN175<>\"\"),IF(OR(AM175<>\"\",AN175<>\"\"),IF(AN175=\"bye\",CONCATENATE($M$16,AM175,IF(AND(AM175<>\"\",AM175<>\"(Q)\"),VLOOKUP(AM175,$Q$11:$R$200,2,0),\"\"),\"..... vs \",AN175,$M$17),CONCATENATE(IF(J175=\"\",$M$12,\"\"),IF(AM175=J175,\"[b]\",\"\"),AM175,IF(AND(AM175<>\"\",AM175<>\"(Q)\"),VLOOKUP(AM175,$Q$11:$R$200,2,0),\"\"),IF(AM175=J175,\"[/b]\",\"\"),\"..... vs \",IF(AN175=J175,\"[b]\",\"\"),AN175,IF(AND(AN175<>\"\",AN175<>\"(Q)\"),VLOOKUP(AN175,$Q$11:$R$200,2,0),\"\"),IF(AN175=J175,\"[/b]\",\"\"),\"..... ( \",IF(AM175=J175,\"[b]\",\"\"),Коэффициенты!F175,IF(AM175=J175,\"[/b]\",\"\"),\" - \",IF(AN175=J175,\"[b]\",\"\"),Коэффициенты!G175,IF(AN175=J175,\"[/b]\",\"\"),\" )\",IF(J175=\"\",$M$13,\"\"))),\"\"),\"\")","v":""},null,null,null,null,null,null,null,null,null,null,{"$f":"IF(Коэффициенты!L175<>\"\",Коэффициенты!L175,\"\")","v":""},{"$f":"IF(Коэффициенты!M156<>\"\",Коэффициенты!M156,\"\")","v":""},null,null,null,null,null,null,null,null,null,null,null,null,null,null,null,null,null,null,null,null,null,{"$f":"IF(Коэффициенты!D175<>\"\",Коэффициенты!D175,\"\")","v":""},{"$f":"IF(Коэффициенты!E175<>\"\",Коэффициенты!E175,\"\")","v":""},""]
[null,{"$f":"IF(Коэффициенты!B176<>\"\",Коэффициенты!B176,\"\")","v":""},"",{"$f":"IF(Коэффициенты!C176<>\"\",Коэффициенты!C176,\"\")","v":""},{"$f":"IF(AND(AM176<>\"\",AN176<>\"\"),IF(OR(AM176<>\"\",AN176<>\"\"),IF(AN176=\"bye\",CONCATENATE($M$16,AM176,IF(AND(AM176<>\"\",AM176<>\"(Q)\"),VLOOKUP(AM176,$Q$11:$R$200,2,0),\"\"),\"..... vs \",AN176,$M$17),CONCATENATE(IF(J176=\"\",$M$12,\"\"),IF(AM176=J176,\"[b]\",\"\"),AM176,IF(AND(AM176<>\"\",AM176<>\"(Q)\"),VLOOKUP(AM176,$Q$11:$R$200,2,0),\"\"),IF(AM176=J176,\"[/b]\",\"\"),\"..... vs \",IF(AN176=J176,\"[b]\",\"\"),AN176,IF(AND(AN176<>\"\",AN176<>\"(Q)\"),VLOOKUP(AN176,$Q$11:$R$200,2,0),\"\"),IF(AN176=J176,\"[/b]\",\"\"),\"..... ( \",IF(AM176=J176,\"[b]\",\"\"),Коэффициенты!F176,IF(AM176=J176,\"[/b]\",\"\"),\" - \",IF(AN176=J176,\"[b]\",\"\"),Коэффициенты!G176,IF(AN176=J176,\"[/b]\",\"\"),\" )\",IF(J176=\"\",$M$13,\"\"))),\"\"),\"\")","v":""},null,null,null,null,null,null,null,null,null,null,{"$f":"IF(Коэффициенты!L176<>\"\",Коэффициенты!L176,\"\")","v":""},{"$f":"IF(Коэффициенты!M157<>\"\",Коэффициенты!M157,\"\")","v":""},null,null,null,null,null,null,null,null,null,null,null,null,null,null,null,null,null,null,null,null,null,{"$f":"IF(Коэффициенты!D176<>\"\",Коэффициенты!D176,\"\")","v":""},{"$f":"IF(Коэффициенты!E176<>\"\",Коэффициенты!E176,\"\")","v":""},""]
[null,{"$f":"IF(Коэффициенты!B177<>\"\",Коэффициенты!B177,\"\")","v":""},"",{"$f":"IF(Коэффициенты!C177<>\"\",Коэффициенты!C177,\"\")","v":""},{"$f":"IF(AND(AM177<>\"\",AN177<>\"\"),IF(OR(AM177<>\"\",AN177<>\"\"),IF(AN177=\"bye\",CONCATENATE($M$16,AM177,IF(AND(AM177<>\"\",AM177<>\"(Q)\"),VLOOKUP(AM177,$Q$11:$R$200,2,0),\"\"),\"..... vs \",AN177,$M$17),CONCATENATE(IF(J177=\"\",$M$12,\"\"),IF(AM177=J177,\"[b]\",\"\"),AM177,IF(AND(AM177<>\"\",AM177<>\"(Q)\"),VLOOKUP(AM177,$Q$11:$R$200,2,0),\"\"),IF(AM177=J177,\"[/b]\",\"\"),\"..... vs \",IF(AN177=J177,\"[b]\",\"\"),AN177,IF(AND(AN177<>\"\",AN177<>\"(Q)\"),VLOOKUP(AN177,$Q$11:$R$200,2,0),\"\"),IF(AN177=J177,\"[/b]\",\"\"),\"..... ( \",IF(AM177=J177,\"[b]\",\"\"),Коэффициенты!F177,IF(AM177=J177,\"[/b]\",\"\"),\" - \",IF(AN177=J177,\"[b]\",\"\"),Коэффициенты!G177,IF(AN177=J177,\"[/b]\",\"\"),\" )\",IF(J177=\"\",$M$13,\"\"))),\"\"),\"\")","v":""},null,null,null,null,null,null,null,null,null,null,{"$f":"IF(Коэффициенты!L177<>\"\",Коэффициенты!L177,\"\")","v":""},{"$f":"IF(Коэффициенты!M158<>\"\",Коэффициенты!M158,\"\")","v":""},null,null,null,null,null,null,null,null,null,null,null,null,null,null,null,null,null,null,null,null,null,{"$f":"IF(Коэффициенты!D177<>\"\",Коэффициенты!D177,\"\")","v":""},{"$f":"IF(Коэффициенты!E177<>\"\",Коэффициенты!E177,\"\")","v":""},""]
[null,{"$f":"IF(Коэффициенты!B178<>\"\",Коэффициенты!B178,\"\")","v":""},"",{"$f":"IF(Коэффициенты!C178<>\"\",Коэффициенты!C178,\"\")","v":""},{"$f":"IF(AND(AM178<>\"\",AN178<>\"\"),IF(OR(AM178<>\"\",AN178<>\"\"),IF(AN178=\"bye\",CONCATENATE($M$16,AM178,IF(AND(AM178<>\"\",AM178<>\"(Q)\"),VLOOKUP(AM178,$Q$11:$R$200,2,0),\"\"),\"..... vs \",AN178,$M$17),CONCATENATE(IF(J178=\"\",$M$12,\"\"),IF(AM178=J178,\"[b]\",\"\"),AM178,IF(AND(AM178<>\"\",AM178<>\"(Q)\"),VLOOKUP(AM178,$Q$11:$R$200,2,0),\"\"),IF(AM178=J178,\"[/b]\",\"\"),\"..... vs \",IF(AN178=J178,\"[b]\",\"\"),AN178,IF(AND(AN178<>\"\",AN178<>\"(Q)\"),VLOOKUP(AN178,$Q$11:$R$200,2,0),\"\"),IF(AN178=J178,\"[/b]\",\"\"),\"..... ( \",IF(AM178=J178,\"[b]\",\"\"),Коэффициенты!F178,IF(AM178=J178,\"[/b]\",\"\"),\" - \",IF(AN178=J178,\"[b]\",\"\"),Коэффициенты!G178,IF(AN178=J178,\"[/b]\",\"\"),\" )\",IF(J178=\"\",$M$13,\"\"))),\"\"),\"\")","v":""},null,null,null,null,null,null,null,null,null,null,{"$f":"IF(Коэффициенты!L178<>\"\",Коэффициенты!L178,\"\")","v":""},{"$f":"IF(Коэффициенты!M159<>\"\",Коэффициенты!M159,\"\")","v":""},null,null,null,null,null,null,null,null,null,null,null,null,null,null,null,null,null,null,null,null,null,{"$f":"IF(Коэффициенты!D178<>\"\",Коэффициенты!D178,\"\")","v":""},{"$f":"IF(Коэффициенты!E178<>\"\",Коэффициенты!E178,\"\")","v":""},""]
[null,{"$f":"IF(Коэффициенты!B179<>\"\",Коэффициенты!B179,\"\")","v":""},"",{"$f":"IF(Коэффициенты!C179<>\"\",Коэффициенты!C179,\"\")","v":""},{"$f":"IF(AND(AM179<>\"\",AN179<>\"\"),IF(OR(AM179<>\"\",AN179<>\"\"),IF(AN179=\"bye\",CONCATENATE($M$16,AM179,IF(AND(AM179<>\"\",AM179<>\"(Q)\"),VLOOKUP(AM179,$Q$11:$R$200,2,0),\"\"),\"..... vs \",AN179,$M$17),CONCATENATE(IF(J179=\"\",$M$12,\"\"),IF(AM179=J179,\"[b]\",\"\"),AM179,IF(AND(AM179<>\"\",AM179<>\"(Q)\"),VLOOKUP(AM179,$Q$11:$R$200,2,0),\"\"),IF(AM179=J179,\"[/b]\",\"\"),\"..... vs \",IF(AN179=J179,\"[b]\",\"\"),AN179,IF(AND(AN179<>\"\",AN179<>\"(Q)\"),VLOOKUP(AN179,$Q$11:$R$200,2,0),\"\"),IF(AN179=J179,\"[/b]\",\"\"),\"..... ( \",IF(AM179=J179,\"[b]\",\"\"),Коэффициенты!F179,IF(AM179=J179,\"[/b]\",\"\"),\" - \",IF(AN179=J179,\"[b]\",\"\"),Коэффициенты!G179,IF(AN179=J179,\"[/b]\",\"\"),\" )\",IF(J179=\"\",$M$13,\"\"))),\"\"),\"\")","v":""},null,null,null,null,null,null,null,null,null,null,{"$f":"IF(Коэффициенты!L179<>\"\",Коэффициенты!L179,\"\")","v":""},{"$f":"IF(Коэффициенты!M160<>\"\",Коэффициенты!M160,\"\")","v":""},null,null,null,null,null,null,null,null,null,null,null,null,null,null,null,null,null,null,null,null,null,{"$f":"IF(Коэффициенты!D179<>\"\",Коэффициенты!D179,\"\")","v":""},{"$f":"IF(Коэффициенты!E179<>\"\",Коэффициенты!E179,\"\")","v":""},""]
[null,{"$f":"IF(Коэффициенты!B180<>\"\",Коэффициенты!B180,\"\")","v":""},"",{"$f":"IF(Коэффициенты!C180<>\"\",Коэффициенты!C180,\"\")","v":""},{"$f":"IF(AND(AM180<>\"\",AN180<>\"\"),IF(OR(AM180<>\"\",AN180<>\"\"),IF(AN180=\"bye\",CONCATENATE($M$16,AM180,IF(AND(AM180<>\"\",AM180<>\"(Q)\"),VLOOKUP(AM180,$Q$11:$R$200,2,0),\"\"),\"..... vs \",AN180,$M$17),CONCATENATE(IF(J180=\"\",$M$12,\"\"),IF(AM180=J180,\"[b]\",\"\"),AM180,IF(AND(AM180<>\"\",AM180<>\"(Q)\"),VLOOKUP(AM180,$Q$11:$R$200,2,0),\"\"),IF(AM180=J180,\"[/b]\",\"\"),\"..... vs \",IF(AN180=J180,\"[b]\",\"\"),AN180,IF(AND(AN180<>\"\",AN180<>\"(Q)\"),VLOOKUP(AN180,$Q$11:$R$200,2,0),\"\"),IF(AN180=J180,\"[/b]\",\"\"),\"..... ( \",IF(AM180=J180,\"[b]\",\"\"),Коэффициенты!F180,IF(AM180=J180,\"[/b]\",\"\"),\" - \",IF(AN180=J180,\"[b]\",\"\"),Коэффициенты!G180,IF(AN180=J180,\"[/b]\",\"\"),\" )\",IF(J180=\"\",$M$13,\"\"))),\"\"),\"\")","v":""},null,null,null,null,null,null,null,null,null,null,{"$f":"IF(Коэффициенты!L180<>\"\",Коэффициенты!L180,\"\")","v":""},{"$f":"IF(Коэффициенты!M161<>\"\",Коэффициенты!M161,\"\")","v":""},null,null,null,null,null,null,null,null,null,null,null,null,null,null,null,null,null,null,null,null,null,{"$f":"IF(Коэффициенты!D180<>\"\",Коэффициенты!D180,\"\")","v":""},{"$f":"IF(Коэффициенты!E180<>\"\",Коэффициенты!E180,\"\")","v":""},""]
[null,{"$f":"IF(Коэффициенты!B181<>\"\",Коэффициенты!B181,\"\")","v":""},"",{"$f":"IF(Коэффициенты!C181<>\"\",Коэффициенты!C181,\"\")","v":""},{"$f":"IF(AND(AM181<>\"\",AN181<>\"\"),IF(OR(AM181<>\"\",AN181<>\"\"),IF(AN181=\"bye\",CONCATENATE($M$16,AM181,IF(AND(AM181<>\"\",AM181<>\"(Q)\"),VLOOKUP(AM181,$Q$11:$R$200,2,0),\"\"),\"..... vs \",AN181,$M$17),CONCATENATE(IF(J181=\"\",$M$12,\"\"),IF(AM181=J181,\"[b]\",\"\"),AM181,IF(AND(AM181<>\"\",AM181<>\"(Q)\"),VLOOKUP(AM181,$Q$11:$R$200,2,0),\"\"),IF(AM181=J181,\"[/b]\",\"\"),\"..... vs \",IF(AN181=J181,\"[b]\",\"\"),AN181,IF(AND(AN181<>\"\",AN181<>\"(Q)\"),VLOOKUP(AN181,$Q$11:$R$200,2,0),\"\"),IF(AN181=J181,\"[/b]\",\"\"),\"..... ( \",IF(AM181=J181,\"[b]\",\"\"),Коэффициенты!F181,IF(AM181=J181,\"[/b]\",\"\"),\" - \",IF(AN181=J181,\"[b]\",\"\"),Коэффициенты!G181,IF(AN181=J181,\"[/b]\",\"\"),\" )\",IF(J181=\"\",$M$13,\"\"))),\"\"),\"\")","v":""},null,null,null,null,null,null,null,null,null,null,{"$f":"IF(Коэффициенты!L181<>\"\",Коэффициенты!L181,\"\")","v":""},{"$f":"IF(Коэффициенты!M162<>\"\",Коэффициенты!M162,\"\")","v":""},null,null,null,null,null,null,null,null,null,null,null,null,null,null,null,null,null,null,null,null,null,{"$f":"IF(Коэффициенты!D181<>\"\",Коэффициенты!D181,\"\")","v":""},{"$f":"IF(Коэффициенты!E181<>\"\",Коэффициенты!E181,\"\")","v":""},""]
[null,{"$f":"IF(Коэффициенты!B182<>\"\",Коэффициенты!B182,\"\")","v":""},"",{"$f":"IF(Коэффициенты!C182<>\"\",Коэффициенты!C182,\"\")","v":""},{"$f":"IF(AND(AM182<>\"\",AN182<>\"\"),IF(OR(AM182<>\"\",AN182<>\"\"),IF(AN182=\"bye\",CONCATENATE($M$16,AM182,IF(AND(AM182<>\"\",AM182<>\"(Q)\"),VLOOKUP(AM182,$Q$11:$R$200,2,0),\"\"),\"..... vs \",AN182,$M$17),CONCATENATE(IF(J182=\"\",$M$12,\"\"),IF(AM182=J182,\"[b]\",\"\"),AM182,IF(AND(AM182<>\"\",AM182<>\"(Q)\"),VLOOKUP(AM182,$Q$11:$R$200,2,0),\"\"),IF(AM182=J182,\"[/b]\",\"\"),\"..... vs \",IF(AN182=J182,\"[b]\",\"\"),AN182,IF(AND(AN182<>\"\",AN182<>\"(Q)\"),VLOOKUP(AN182,$Q$11:$R$200,2,0),\"\"),IF(AN182=J182,\"[/b]\",\"\"),\"..... ( \",IF(AM182=J182,\"[b]\",\"\"),Коэффициенты!F182,IF(AM182=J182,\"[/b]\",\"\"),\" - \",IF(AN182=J182,\"[b]\",\"\"),Коэффициенты!G182,IF(AN182=J182,\"[/b]\",\"\"),\" )\",IF(J182=\"\",$M$13,\"\"))),\"\"),\"\")","v":""},null,null,null,null,null,null,null,null,null,null,{"$f":"IF(Коэффициенты!L182<>\"\",Коэффициенты!L182,\"\")","v":""},{"$f":"IF(Коэффициенты!M163<>\"\",Коэффициенты!M163,\"\")","v":""},null,null,null,null,null,null,null,null,null,null,null,null,null,null,null,null,null,null,null,null,null,{"$f":"IF(Коэффициенты!D182<>\"\",Коэффициенты!D182,\"\")","v":""},{"$f":"IF(Коэффициенты!E182<>\"\",Коэффициенты!E182,\"\")","v":""},""]
[null,{"$f":"IF(Коэффициенты!B183<>\"\",Коэффициенты!B183,\"\")","v":""},"",{"$f":"IF(Коэффициенты!C183<>\"\",Коэффициенты!C183,\"\")","v":""},{"$f":"IF(AND(AM183<>\"\",AN183<>\"\"),IF(OR(AM183<>\"\",AN183<>\"\"),IF(AN183=\"bye\",CONCATENATE($M$16,AM183,IF(AND(AM183<>\"\",AM183<>\"(Q)\"),VLOOKUP(AM183,$Q$11:$R$200,2,0),\"\"),\"..... vs \",AN183,$M$17),CONCATENATE(IF(J183=\"\",$M$12,\"\"),IF(AM183=J183,\"[b]\",\"\"),AM183,IF(AND(AM183<>\"\",AM183<>\"(Q)\"),VLOOKUP(AM183,$Q$11:$R$200,2,0),\"\"),IF(AM183=J183,\"[/b]\",\"\"),\"..... vs \",IF(AN183=J183,\"[b]\",\"\"),AN183,IF(AND(AN183<>\"\",AN183<>\"(Q)\"),VLOOKUP(AN183,$Q$11:$R$200,2,0),\"\"),IF(AN183=J183,\"[/b]\",\"\"),\"..... ( \",IF(AM183=J183,\"[b]\",\"\"),Коэффициенты!F183,IF(AM183=J183,\"[/b]\",\"\"),\" - \",IF(AN183=J183,\"[b]\",\"\"),Коэффициенты!G183,IF(AN183=J183,\"[/b]\",\"\"),\" )\",IF(J183=\"\",$M$13,\"\"))),\"\"),\"\")","v":""},null,null,null,null,null,null,null,null,null,null,{"$f":"IF(Коэффициенты!L183<>\"\",Коэффициенты!L183,\"\")","v":""},{"$f":"IF(Коэффициенты!M164<>\"\",Коэффициенты!M164,\"\")","v":""},null,null,null,null,null,null,null,null,null,null,null,null,null,null,null,null,null,null,null,null,null,{"$f":"IF(Коэффициенты!D183<>\"\",Коэффициенты!D183,\"\")","v":""},{"$f":"IF(Коэффициенты!E183<>\"\",Коэффициенты!E183,\"\")","v":""},""]
[null,{"$f":"IF(Коэффициенты!B184<>\"\",Коэффициенты!B184,\"\")","v":""},"",{"$f":"IF(Коэффициенты!C184<>\"\",Коэффициенты!C184,\"\")","v":""},{"$f":"IF(AND(AM184<>\"\",AN184<>\"\"),IF(OR(AM184<>\"\",AN184<>\"\"),IF(AN184=\"bye\",CONCATENATE($M$16,AM184,IF(AND(AM184<>\"\",AM184<>\"(Q)\"),VLOOKUP(AM184,$Q$11:$R$200,2,0),\"\"),\"..... vs \",AN184,$M$17),CONCATENATE(IF(J184=\"\",$M$12,\"\"),IF(AM184=J184,\"[b]\",\"\"),AM184,IF(AND(AM184<>\"\",AM184<>\"(Q)\"),VLOOKUP(AM184,$Q$11:$R$200,2,0),\"\"),IF(AM184=J184,\"[/b]\",\"\"),\"..... vs \",IF(AN184=J184,\"[b]\",\"\"),AN184,IF(AND(AN184<>\"\",AN184<>\"(Q)\"),VLOOKUP(AN184,$Q$11:$R$200,2,0),\"\"),IF(AN184=J184,\"[/b]\",\"\"),\"..... ( \",IF(AM184=J184,\"[b]\",\"\"),Коэффициенты!F184,IF(AM184=J184,\"[/b]\",\"\"),\" - \",IF(AN184=J184,\"[b]\",\"\"),Коэффициенты!G184,IF(AN184=J184,\"[/b]\",\"\"),\" )\",IF(J184=\"\",$M$13,\"\"))),\"\"),\"\")","v":""},null,null,null,null,null,null,null,null,null,null,{"$f":"IF(Коэффициенты!L184<>\"\",Коэффициенты!L184,\"\")","v":""},{"$f":"IF(Коэффициенты!M165<>\"\",Коэффициенты!M165,\"\")","v":""},null,null,null,null,null,null,null,null,null,null,null,null,null,null,null,null,null,null,null,null,null,{"$f":"IF(Коэффициенты!D184<>\"\",Коэффициенты!D184,\"\")","v":""},{"$f":"IF(Коэффициенты!E184<>\"\",Коэффициенты!E184,\"\")","v":""},""]
[null,{"$f":"IF(Коэффициенты!B185<>\"\",Коэффициенты!B185,\"\")","v":""},"",{"$f":"IF(Коэффициенты!C185<>\"\",Коэффициенты!C185,\"\")","v":""},{"$f":"IF(AND(AM185<>\"\",AN185<>\"\"),IF(OR(AM185<>\"\",AN185<>\"\"),IF(AN185=\"bye\",CONCATENATE($M$16,AM185,IF(AND(AM185<>\"\",AM185<>\"(Q)\"),VLOOKUP(AM185,$Q$11:$R$200,2,0),\"\"),\"..... vs \",AN185,$M$17),CONCATENATE(IF(J185=\"\",$M$12,\"\"),IF(AM185=J185,\"[b]\",\"\"),AM185,IF(AND(AM185<>\"\",AM185<>\"(Q)\"),VLOOKUP(AM185,$Q$11:$R$200,2,0),\"\"),IF(AM185=J185,\"[/b]\",\"\"),\"..... vs \",IF(AN185=J185,\"[b]\",\"\"),AN185,IF(AND(AN185<>\"\",AN185<>\"(Q)\"),VLOOKUP(AN185,$Q$11:$R$200,2,0),\"\"),IF(AN185=J185,\"[/b]\",\"\"),\"..... ( \",IF(AM185=J185,\"[b]\",\"\"),Коэффициенты!F185,IF(AM185=J185,\"[/b]\",\"\"),\" - \",IF(AN185=J185,\"[b]\",\"\"),Коэффициенты!G185,IF(AN185=J185,\"[/b]\",\"\"),\" )\",IF(J185=\"\",$M$13,\"\"))),\"\"),\"\")","v":""},null,null,null,null,null,null,null,null,null,null,{"$f":"IF(Коэффициенты!L185<>\"\",Коэффициенты!L185,\"\")","v":""},{"$f":"IF(Коэффициенты!M166<>\"\",Коэффициенты!M166,\"\")","v":""},null,null,null,null,null,null,null,null,null,null,null,null,null,null,null,null,null,null,null,null,null,{"$f":"IF(Коэффициенты!D185<>\"\",Коэффициенты!D185,\"\")","v":""},{"$f":"IF(Коэффициенты!E185<>\"\",Коэффициенты!E185,\"\")","v":""},""]
[null,{"$f":"IF(Коэффициенты!B186<>\"\",Коэффициенты!B186,\"\")","v":""},"",{"$f":"IF(Коэффициенты!C186<>\"\",Коэффициенты!C186,\"\")","v":""},{"$f":"IF(AND(AM186<>\"\",AN186<>\"\"),IF(OR(AM186<>\"\",AN186<>\"\"),IF(AN186=\"bye\",CONCATENATE($M$16,AM186,IF(AND(AM186<>\"\",AM186<>\"(Q)\"),VLOOKUP(AM186,$Q$11:$R$200,2,0),\"\"),\"..... vs \",AN186,$M$17),CONCATENATE(IF(J186=\"\",$M$12,\"\"),IF(AM186=J186,\"[b]\",\"\"),AM186,IF(AND(AM186<>\"\",AM186<>\"(Q)\"),VLOOKUP(AM186,$Q$11:$R$200,2,0),\"\"),IF(AM186=J186,\"[/b]\",\"\"),\"..... vs \",IF(AN186=J186,\"[b]\",\"\"),AN186,IF(AND(AN186<>\"\",AN186<>\"(Q)\"),VLOOKUP(AN186,$Q$11:$R$200,2,0),\"\"),IF(AN186=J186,\"[/b]\",\"\"),\"..... ( \",IF(AM186=J186,\"[b]\",\"\"),Коэффициенты!F186,IF(AM186=J186,\"[/b]\",\"\"),\" - \",IF(AN186=J186,\"[b]\",\"\"),Коэффициенты!G186,IF(AN186=J186,\"[/b]\",\"\"),\" )\",IF(J186=\"\",$M$13,\"\"))),\"\"),\"\")","v":""},null,null,null,null,null,null,null,null,null,null,{"$f":"IF(Коэффициенты!L186<>\"\",Коэффициенты!L186,\"\")","v":""},{"$f":"IF(Коэффициенты!M167<>\"\",Коэффициенты!M167,\"\")","v":""},null,null,null,null,null,null,null,null,null,null,null,null,null,null,null,null,null,null,null,null,null,{"$f":"IF(Коэффициенты!D186<>\"\",Коэффициенты!D186,\"\")","v":""},{"$f":"IF(Коэффициенты!E186<>\"\",Коэффициенты!E186,\"\")","v":""},""]
[null,{"$f":"IF(Коэффициенты!B187<>\"\",Коэффициенты!B187,\"\")","v":""},"",{"$f":"IF(Коэффициенты!C187<>\"\",Коэффициенты!C187,\"\")","v":""},{"$f":"IF(AND(AM187<>\"\",AN187<>\"\"),IF(OR(AM187<>\"\",AN187<>\"\"),IF(AN187=\"bye\",CONCATENATE($M$16,AM187,IF(AND(AM187<>\"\",AM187<>\"(Q)\"),VLOOKUP(AM187,$Q$11:$R$200,2,0),\"\"),\"..... vs \",AN187,$M$17),CONCATENATE(IF(J187=\"\",$M$12,\"\"),IF(AM187=J187,\"[b]\",\"\"),AM187,IF(AND(AM187<>\"\",AM187<>\"(Q)\"),VLOOKUP(AM187,$Q$11:$R$200,2,0),\"\"),IF(AM187=J187,\"[/b]\",\"\"),\"..... vs \",IF(AN187=J187,\"[b]\",\"\"),AN187,IF(AND(AN187<>\"\",AN187<>\"(Q)\"),VLOOKUP(AN187,$Q$11:$R$200,2,0),\"\"),IF(AN187=J187,\"[/b]\",\"\"),\"..... ( \",IF(AM187=J187,\"[b]\",\"\"),Коэффициенты!F187,IF(AM187=J187,\"[/b]\",\"\"),\" - \",IF(AN187=J187,\"[b]\",\"\"),Коэффициенты!G187,IF(AN187=J187,\"[/b]\",\"\"),\" )\",IF(J187=\"\",$M$13,\"\"))),\"\"),\"\")","v":""},null,null,null,null,null,null,null,null,null,null,{"$f":"IF(Коэффициенты!L187<>\"\",Коэффициенты!L187,\"\")","v":""},{"$f":"IF(Коэффициенты!M168<>\"\",Коэффициенты!M168,\"\")","v":""},null,null,null,null,null,null,null,null,null,null,null,null,null,null,null,null,null,null,null,null,null,{"$f":"IF(Коэффициенты!D187<>\"\",Коэффициенты!D187,\"\")","v":""},{"$f":"IF(Коэффициенты!E187<>\"\",Коэффициенты!E187,\"\")","v":""},""]
[null,{"$f":"IF(Коэффициенты!B188<>\"\",Коэффициенты!B188,\"\")","v":""},"",{"$f":"IF(Коэффициенты!C188<>\"\",Коэффициенты!C188,\"\")","v":""},{"$f":"IF(AND(AM188<>\"\",AN188<>\"\"),IF(OR(AM188<>\"\",AN188<>\"\"),IF(AN188=\"bye\",CONCATENATE($M$16,AM188,IF(AND(AM188<>\"\",AM188<>\"(Q)\"),VLOOKUP(AM188,$Q$11:$R$200,2,0),\"\"),\"..... vs \",AN188,$M$17),CONCATENATE(IF(J188=\"\",$M$12,\"\"),IF(AM188=J188,\"[b]\",\"\"),AM188,IF(AND(AM188<>\"\",AM188<>\"(Q)\"),VLOOKUP(AM188,$Q$11:$R$200,2,0),\"\"),IF(AM188=J188,\"[/b]\",\"\"),\"..... vs \",IF(AN188=J188,\"[b]\",\"\"),AN188,IF(AND(AN188<>\"\",AN188<>\"(Q)\"),VLOOKUP(AN188,$Q$11:$R$200,2,0),\"\"),IF(AN188=J188,\"[/b]\",\"\"),\"..... ( \",IF(AM188=J188,\"[b]\",\"\"),Коэффициенты!F188,IF(AM188=J188,\"[/b]\",\"\"),\" - \",IF(AN188=J188,\"[b]\",\"\"),Коэффициенты!G188,IF(AN188=J188,\"[/b]\",\"\"),\" )\",IF(J188=\"\",$M$13,\"\"))),\"\"),\"\")","v":""},null,null,null,null,null,null,null,null,null,null,{"$f":"IF(Коэффициенты!L188<>\"\",Коэффициенты!L188,\"\")","v":""},{"$f":"IF(Коэффициенты!M169<>\"\",Коэффициенты!M169,\"\")","v":""},null,null,null,null,null,null,null,null,null,null,null,null,null,null,null,null,null,null,null,null,null,{"$f":"IF(Коэффициенты!D188<>\"\",Коэффициенты!D188,\"\")","v":""},{"$f":"IF(Коэффициенты!E188<>\"\",Коэффициенты!E188,\"\")","v":""},""]
[null,{"$f":"IF(Коэффициенты!B189<>\"\",Коэффициенты!B189,\"\")","v":""},"",{"$f":"IF(Коэффициенты!C189<>\"\",Коэффициенты!C189,\"\")","v":""},{"$f":"IF(AND(AM189<>\"\",AN189<>\"\"),IF(OR(AM189<>\"\",AN189<>\"\"),IF(AN189=\"bye\",CONCATENATE($M$16,AM189,IF(AND(AM189<>\"\",AM189<>\"(Q)\"),VLOOKUP(AM189,$Q$11:$R$200,2,0),\"\"),\"..... vs \",AN189,$M$17),CONCATENATE(IF(J189=\"\",$M$12,\"\"),IF(AM189=J189,\"[b]\",\"\"),AM189,IF(AND(AM189<>\"\",AM189<>\"(Q)\"),VLOOKUP(AM189,$Q$11:$R$200,2,0),\"\"),IF(AM189=J189,\"[/b]\",\"\"),\"..... vs \",IF(AN189=J189,\"[b]\",\"\"),AN189,IF(AND(AN189<>\"\",AN189<>\"(Q)\"),VLOOKUP(AN189,$Q$11:$R$200,2,0),\"\"),IF(AN189=J189,\"[/b]\",\"\"),\"..... ( \",IF(AM189=J189,\"[b]\",\"\"),Коэффициенты!F189,IF(AM189=J189,\"[/b]\",\"\"),\" - \",IF(AN189=J189,\"[b]\",\"\"),Коэффициенты!G189,IF(AN189=J189,\"[/b]\",\"\"),\" )\",IF(J189=\"\",$M$13,\"\"))),\"\"),\"\")","v":""},null,null,null,null,null,null,null,null,null,null,{"$f":"IF(Коэффициенты!L189<>\"\",Коэффициенты!L189,\"\")","v":""},{"$f":"IF(Коэффициенты!M170<>\"\",Коэффициенты!M170,\"\")","v":""},null,null,null,null,null,null,null,null,null,null,null,null,null,null,null,null,null,null,null,null,null,{"$f":"IF(Коэффициенты!D189<>\"\",Коэффициенты!D189,\"\")","v":""},{"$f":"IF(Коэффициенты!E189<>\"\",Коэффициенты!E189,\"\")","v":""},""]
[null,{"$f":"IF(Коэффициенты!B190<>\"\",Коэффициенты!B190,\"\")","v":""},"",{"$f":"IF(Коэффициенты!C190<>\"\",Коэффициенты!C190,\"\")","v":""},{"$f":"IF(AND(AM190<>\"\",AN190<>\"\"),IF(OR(AM190<>\"\",AN190<>\"\"),IF(AN190=\"bye\",CONCATENATE($M$16,AM190,IF(AND(AM190<>\"\",AM190<>\"(Q)\"),VLOOKUP(AM190,$Q$11:$R$200,2,0),\"\"),\"..... vs \",AN190,$M$17),CONCATENATE(IF(J190=\"\",$M$12,\"\"),IF(AM190=J190,\"[b]\",\"\"),AM190,IF(AND(AM190<>\"\",AM190<>\"(Q)\"),VLOOKUP(AM190,$Q$11:$R$200,2,0),\"\"),IF(AM190=J190,\"[/b]\",\"\"),\"..... vs \",IF(AN190=J190,\"[b]\",\"\"),AN190,IF(AND(AN190<>\"\",AN190<>\"(Q)\"),VLOOKUP(AN190,$Q$11:$R$200,2,0),\"\"),IF(AN190=J190,\"[/b]\",\"\"),\"..... ( \",IF(AM190=J190,\"[b]\",\"\"),Коэффициенты!F190,IF(AM190=J190,\"[/b]\",\"\"),\" - \",IF(AN190=J190,\"[b]\",\"\"),Коэффициенты!G190,IF(AN190=J190,\"[/b]\",\"\"),\" )\",IF(J190=\"\",$M$13,\"\"))),\"\"),\"\")","v":""},null,null,null,null,null,null,null,null,null,null,{"$f":"IF(Коэффициенты!L190<>\"\",Коэффициенты!L190,\"\")","v":""},{"$f":"IF(Коэффициенты!M171<>\"\",Коэффициенты!M171,\"\")","v":""},null,null,null,null,null,null,null,null,null,null,null,null,null,null,null,null,null,null,null,null,null,{"$f":"IF(Коэффициенты!D190<>\"\",Коэффициенты!D190,\"\")","v":""},{"$f":"IF(Коэффициенты!E190<>\"\",Коэффициенты!E190,\"\")","v":""},""]
[null,{"$f":"IF(Коэффициенты!B191<>\"\",Коэффициенты!B191,\"\")","v":""},"",{"$f":"IF(Коэффициенты!C191<>\"\",Коэффициенты!C191,\"\")","v":""},{"$f":"IF(AND(AM191<>\"\",AN191<>\"\"),IF(OR(AM191<>\"\",AN191<>\"\"),IF(AN191=\"bye\",CONCATENATE($M$16,AM191,IF(AND(AM191<>\"\",AM191<>\"(Q)\"),VLOOKUP(AM191,$Q$11:$R$200,2,0),\"\"),\"..... vs \",AN191,$M$17),CONCATENATE(IF(J191=\"\",$M$12,\"\"),IF(AM191=J191,\"[b]\",\"\"),AM191,IF(AND(AM191<>\"\",AM191<>\"(Q)\"),VLOOKUP(AM191,$Q$11:$R$200,2,0),\"\"),IF(AM191=J191,\"[/b]\",\"\"),\"..... vs \",IF(AN191=J191,\"[b]\",\"\"),AN191,IF(AND(AN191<>\"\",AN191<>\"(Q)\"),VLOOKUP(AN191,$Q$11:$R$200,2,0),\"\"),IF(AN191=J191,\"[/b]\",\"\"),\"..... ( \",IF(AM191=J191,\"[b]\",\"\"),Коэффициенты!F191,IF(AM191=J191,\"[/b]\",\"\"),\" - \",IF(AN191=J191,\"[b]\",\"\"),Коэффициенты!G191,IF(AN191=J191,\"[/b]\",\"\"),\" )\",IF(J191=\"\",$M$13,\"\"))),\"\"),\"\")","v":""},null,null,null,null,null,null,null,null,null,null,{"$f":"IF(Коэффициенты!L191<>\"\",Коэффициенты!L191,\"\")","v":""},{"$f":"IF(Коэффициенты!M172<>\"\",Коэффициенты!M172,\"\")","v":""},null,null,null,null,null,null,null,null,null,null,null,null,null,null,null,null,null,null,null,null,null,{"$f":"IF(Коэффициенты!D191<>\"\",Коэффициенты!D191,\"\")","v":""},{"$f":"IF(Коэффициенты!E191<>\"\",Коэффициенты!E191,\"\")","v":""},""]
[null,{"$f":"IF(Коэффициенты!B192<>\"\",Коэффициенты!B192,\"\")","v":""},"",{"$f":"IF(Коэффициенты!C192<>\"\",Коэффициенты!C192,\"\")","v":""},{"$f":"IF(AND(AM192<>\"\",AN192<>\"\"),IF(OR(AM192<>\"\",AN192<>\"\"),IF(AN192=\"bye\",CONCATENATE($M$16,AM192,IF(AND(AM192<>\"\",AM192<>\"(Q)\"),VLOOKUP(AM192,$Q$11:$R$200,2,0),\"\"),\"..... vs \",AN192,$M$17),CONCATENATE(IF(J192=\"\",$M$12,\"\"),IF(AM192=J192,\"[b]\",\"\"),AM192,IF(AND(AM192<>\"\",AM192<>\"(Q)\"),VLOOKUP(AM192,$Q$11:$R$200,2,0),\"\"),IF(AM192=J192,\"[/b]\",\"\"),\"..... vs \",IF(AN192=J192,\"[b]\",\"\"),AN192,IF(AND(AN192<>\"\",AN192<>\"(Q)\"),VLOOKUP(AN192,$Q$11:$R$200,2,0),\"\"),IF(AN192=J192,\"[/b]\",\"\"),\"..... ( \",IF(AM192=J192,\"[b]\",\"\"),Коэффициенты!F192,IF(AM192=J192,\"[/b]\",\"\"),\" - \",IF(AN192=J192,\"[b]\",\"\"),Коэффициенты!G192,IF(AN192=J192,\"[/b]\",\"\"),\" )\",IF(J192=\"\",$M$13,\"\"))),\"\"),\"\")","v":""},null,null,null,null,null,null,null,null,null,null,{"$f":"IF(Коэффициенты!L192<>\"\",Коэффициенты!L192,\"\")","v":""},{"$f":"IF(Коэффициенты!M173<>\"\",Коэффициенты!M173,\"\")","v":""},null,null,null,null,null,null,null,null,null,null,null,null,null,null,null,null,null,null,null,null,null,{"$f":"IF(Коэффициенты!D192<>\"\",Коэффициенты!D192,\"\")","v":""},{"$f":"IF(Коэффициенты!E192<>\"\",Коэффициенты!E192,\"\")","v":""},""]
[null,{"$f":"IF(Коэффициенты!B193<>\"\",Коэффициенты!B193,\"\")","v":""},"",{"$f":"IF(Коэффициенты!C193<>\"\",Коэффициенты!C193,\"\")","v":""},{"$f":"IF(AND(AM193<>\"\",AN193<>\"\"),IF(OR(AM193<>\"\",AN193<>\"\"),IF(AN193=\"bye\",CONCATENATE($M$16,AM193,IF(AND(AM193<>\"\",AM193<>\"(Q)\"),VLOOKUP(AM193,$Q$11:$R$200,2,0),\"\"),\"..... vs \",AN193,$M$17),CONCATENATE(IF(J193=\"\",$M$12,\"\"),IF(AM193=J193,\"[b]\",\"\"),AM193,IF(AND(AM193<>\"\",AM193<>\"(Q)\"),VLOOKUP(AM193,$Q$11:$R$200,2,0),\"\"),IF(AM193=J193,\"[/b]\",\"\"),\"..... vs \",IF(AN193=J193,\"[b]\",\"\"),AN193,IF(AND(AN193<>\"\",AN193<>\"(Q)\"),VLOOKUP(AN193,$Q$11:$R$200,2,0),\"\"),IF(AN193=J193,\"[/b]\",\"\"),\"..... ( \",IF(AM193=J193,\"[b]\",\"\"),Коэффициенты!F193,IF(AM193=J193,\"[/b]\",\"\"),\" - \",IF(AN193=J193,\"[b]\",\"\"),Коэффициенты!G193,IF(AN193=J193,\"[/b]\",\"\"),\" )\",IF(J193=\"\",$M$13,\"\"))),\"\"),\"\")","v":""},null,null,null,null,null,null,null,null,null,null,{"$f":"IF(Коэффициенты!L193<>\"\",Коэффициенты!L193,\"\")","v":""},{"$f":"IF(Коэффициенты!M174<>\"\",Коэффициенты!M174,\"\")","v":""},null,null,null,null,null,null,null,null,null,null,null,null,null,null,null,null,null,null,null,null,null,{"$f":"IF(Коэффициенты!D193<>\"\",Коэффициенты!D193,\"\")","v":""},{"$f":"IF(Коэффициенты!E193<>\"\",Коэффициенты!E193,\"\")","v":""},""]
[null,{"$f":"IF(Коэффициенты!B194<>\"\",Коэффициенты!B194,\"\")","v":""},"",{"$f":"IF(Коэффициенты!C194<>\"\",Коэффициенты!C194,\"\")","v":""},{"$f":"IF(AND(AM194<>\"\",AN194<>\"\"),IF(OR(AM194<>\"\",AN194<>\"\"),IF(AN194=\"bye\",CONCATENATE($M$16,AM194,IF(AND(AM194<>\"\",AM194<>\"(Q)\"),VLOOKUP(AM194,$Q$11:$R$200,2,0),\"\"),\"..... vs \",AN194,$M$17),CONCATENATE(IF(J194=\"\",$M$12,\"\"),IF(AM194=J194,\"[b]\",\"\"),AM194,IF(AND(AM194<>\"\",AM194<>\"(Q)\"),VLOOKUP(AM194,$Q$11:$R$200,2,0),\"\"),IF(AM194=J194,\"[/b]\",\"\"),\"..... vs \",IF(AN194=J194,\"[b]\",\"\"),AN194,IF(AND(AN194<>\"\",AN194<>\"(Q)\"),VLOOKUP(AN194,$Q$11:$R$200,2,0),\"\"),IF(AN194=J194,\"[/b]\",\"\"),\"..... ( \",IF(AM194=J194,\"[b]\",\"\"),Коэффициенты!F194,IF(AM194=J194,\"[/b]\",\"\"),\" - \",IF(AN194=J194,\"[b]\",\"\"),Коэффициенты!G194,IF(AN194=J194,\"[/b]\",\"\"),\" )\",IF(J194=\"\",$M$13,\"\"))),\"\"),\"\")","v":""},null,null,null,null,null,null,null,null,null,null,{"$f":"IF(Коэффициенты!L194<>\"\",Коэффициенты!L194,\"\")","v":""},{"$f":"IF(Коэффициенты!M175<>\"\",Коэффициенты!M175,\"\")","v":""},null,null,null,null,null,null,null,null,null,null,null,null,null,null,null,null,null,null,null,null,null,{"$f":"IF(Коэффициенты!D194<>\"\",Коэффициенты!D194,\"\")","v":""},{"$f":"IF(Коэффициенты!E194<>\"\",Коэффициенты!E194,\"\")","v":""},""]
[null,{"$f":"IF(Коэффициенты!B195<>\"\",Коэффициенты!B195,\"\")","v":""},"",{"$f":"IF(Коэффициенты!C195<>\"\",Коэффициенты!C195,\"\")","v":""},{"$f":"IF(AND(AM195<>\"\",AN195<>\"\"),IF(OR(AM195<>\"\",AN195<>\"\"),IF(AN195=\"bye\",CONCATENATE($M$16,AM195,IF(AND(AM195<>\"\",AM195<>\"(Q)\"),VLOOKUP(AM195,$Q$11:$R$200,2,0),\"\"),\"..... vs \",AN195,$M$17),CONCATENATE(IF(J195=\"\",$M$12,\"\"),IF(AM195=J195,\"[b]\",\"\"),AM195,IF(AND(AM195<>\"\",AM195<>\"(Q)\"),VLOOKUP(AM195,$Q$11:$R$200,2,0),\"\"),IF(AM195=J195,\"[/b]\",\"\"),\"..... vs \",IF(AN195=J195,\"[b]\",\"\"),AN195,IF(AND(AN195<>\"\",AN195<>\"(Q)\"),VLOOKUP(AN195,$Q$11:$R$200,2,0),\"\"),IF(AN195=J195,\"[/b]\",\"\"),\"..... ( \",IF(AM195=J195,\"[b]\",\"\"),Коэффициенты!F195,IF(AM195=J195,\"[/b]\",\"\"),\" - \",IF(AN195=J195,\"[b]\",\"\"),Коэффициенты!G195,IF(AN195=J195,\"[/b]\",\"\"),\" )\",IF(J195=\"\",$M$13,\"\"))),\"\"),\"\")","v":""},null,null,null,null,null,null,null,null,null,null,{"$f":"IF(Коэффициенты!L195<>\"\",Коэффициенты!L195,\"\")","v":""},{"$f":"IF(Коэффициенты!M176<>\"\",Коэффициенты!M176,\"\")","v":""},null,null,null,null,null,null,null,null,null,null,null,null,null,null,null,null,null,null,null,null,null,{"$f":"IF(Коэффициенты!D195<>\"\",Коэффициенты!D195,\"\")","v":""},{"$f":"IF(Коэффициенты!E195<>\"\",Коэффициенты!E195,\"\")","v":""},""]
[null,{"$f":"IF(Коэффициенты!B196<>\"\",Коэффициенты!B196,\"\")","v":""},"",{"$f":"IF(Коэффициенты!C196<>\"\",Коэффициенты!C196,\"\")","v":""},{"$f":"IF(AND(AM196<>\"\",AN196<>\"\"),IF(OR(AM196<>\"\",AN196<>\"\"),IF(AN196=\"bye\",CONCATENATE($M$16,AM196,IF(AND(AM196<>\"\",AM196<>\"(Q)\"),VLOOKUP(AM196,$Q$11:$R$200,2,0),\"\"),\"..... vs \",AN196,$M$17),CONCATENATE(IF(J196=\"\",$M$12,\"\"),IF(AM196=J196,\"[b]\",\"\"),AM196,IF(AND(AM196<>\"\",AM196<>\"(Q)\"),VLOOKUP(AM196,$Q$11:$R$200,2,0),\"\"),IF(AM196=J196,\"[/b]\",\"\"),\"..... vs \",IF(AN196=J196,\"[b]\",\"\"),AN196,IF(AND(AN196<>\"\",AN196<>\"(Q)\"),VLOOKUP(AN196,$Q$11:$R$200,2,0),\"\"),IF(AN196=J196,\"[/b]\",\"\"),\"..... ( \",IF(AM196=J196,\"[b]\",\"\"),Коэффициенты!F196,IF(AM196=J196,\"[/b]\",\"\"),\" - \",IF(AN196=J196,\"[b]\",\"\"),Коэффициенты!G196,IF(AN196=J196,\"[/b]\",\"\"),\" )\",IF(J196=\"\",$M$13,\"\"))),\"\"),\"\")","v":""},null,null,null,null,null,null,null,null,null,null,{"$f":"IF(Коэффициенты!L196<>\"\",Коэффициенты!L196,\"\")","v":""},{"$f":"IF(Коэффициенты!M177<>\"\",Коэффициенты!M177,\"\")","v":""},null,null,null,null,null,null,null,null,null,null,null,null,null,null,null,null,null,null,null,null,null,{"$f":"IF(Коэффициенты!D196<>\"\",Коэффициенты!D196,\"\")","v":""},{"$f":"IF(Коэффициенты!E196<>\"\",Коэффициенты!E196,\"\")","v":""},""]
[null,{"$f":"IF(Коэффициенты!B197<>\"\",Коэффициенты!B197,\"\")","v":""},"",{"$f":"IF(Коэффициенты!C197<>\"\",Коэффициенты!C197,\"\")","v":""},{"$f":"IF(AND(AM197<>\"\",AN197<>\"\"),IF(OR(AM197<>\"\",AN197<>\"\"),IF(AN197=\"bye\",CONCATENATE($M$16,AM197,IF(AND(AM197<>\"\",AM197<>\"(Q)\"),VLOOKUP(AM197,$Q$11:$R$200,2,0),\"\"),\"..... vs \",AN197,$M$17),CONCATENATE(IF(J197=\"\",$M$12,\"\"),IF(AM197=J197,\"[b]\",\"\"),AM197,IF(AND(AM197<>\"\",AM197<>\"(Q)\"),VLOOKUP(AM197,$Q$11:$R$200,2,0),\"\"),IF(AM197=J197,\"[/b]\",\"\"),\"..... vs \",IF(AN197=J197,\"[b]\",\"\"),AN197,IF(AND(AN197<>\"\",AN197<>\"(Q)\"),VLOOKUP(AN197,$Q$11:$R$200,2,0),\"\"),IF(AN197=J197,\"[/b]\",\"\"),\"..... ( \",IF(AM197=J197,\"[b]\",\"\"),Коэффициенты!F197,IF(AM197=J197,\"[/b]\",\"\"),\" - \",IF(AN197=J197,\"[b]\",\"\"),Коэффициенты!G197,IF(AN197=J197,\"[/b]\",\"\"),\" )\",IF(J197=\"\",$M$13,\"\"))),\"\"),\"\")","v":""},null,null,null,null,null,null,null,null,null,null,{"$f":"IF(Коэффициенты!L197<>\"\",Коэффициенты!L197,\"\")","v":""},{"$f":"IF(Коэффициенты!M178<>\"\",Коэффициенты!M178,\"\")","v":""},null,null,null,null,null,null,null,null,null,null,null,null,null,null,null,null,null,null,null,null,null,{"$f":"IF(Коэффициенты!D197<>\"\",Коэффициенты!D197,\"\")","v":""},{"$f":"IF(Коэффициенты!E197<>\"\",Коэффициенты!E197,\"\")","v":""},""]
[null,{"$f":"IF(Коэффициенты!B198<>\"\",Коэффициенты!B198,\"\")","v":""},"",{"$f":"IF(Коэффициенты!C198<>\"\",Коэффициенты!C198,\"\")","v":""},{"$f":"IF(AND(AM198<>\"\",AN198<>\"\"),IF(OR(AM198<>\"\",AN198<>\"\"),IF(AN198=\"bye\",CONCATENATE($M$16,AM198,IF(AND(AM198<>\"\",AM198<>\"(Q)\"),VLOOKUP(AM198,$Q$11:$R$200,2,0),\"\"),\"..... vs \",AN198,$M$17),CONCATENATE(IF(J198=\"\",$M$12,\"\"),IF(AM198=J198,\"[b]\",\"\"),AM198,IF(AND(AM198<>\"\",AM198<>\"(Q)\"),VLOOKUP(AM198,$Q$11:$R$200,2,0),\"\"),IF(AM198=J198,\"[/b]\",\"\"),\"..... vs \",IF(AN198=J198,\"[b]\",\"\"),AN198,IF(AND(AN198<>\"\",AN198<>\"(Q)\"),VLOOKUP(AN198,$Q$11:$R$200,2,0),\"\"),IF(AN198=J198,\"[/b]\",\"\"),\"..... ( \",IF(AM198=J198,\"[b]\",\"\"),Коэффициенты!F198,IF(AM198=J198,\"[/b]\",\"\"),\" - \",IF(AN198=J198,\"[b]\",\"\"),Коэффициенты!G198,IF(AN198=J198,\"[/b]\",\"\"),\" )\",IF(J198=\"\",$M$13,\"\"))),\"\"),\"\")","v":""},null,null,null,null,null,null,null,null,null,null,{"$f":"IF(Коэффициенты!L198<>\"\",Коэффициенты!L198,\"\")","v":""},{"$f":"IF(Коэффициенты!M179<>\"\",Коэффициенты!M179,\"\")","v":""},null,null,null,null,null,null,null,null,null,null,null,null,null,null,null,null,null,null,null,null,null,{"$f":"IF(Коэффициенты!D198<>\"\",Коэффициенты!D198,\"\")","v":""},{"$f":"IF(Коэффициенты!E198<>\"\",Коэффициенты!E198,\"\")","v":""},""]
[null,{"$f":"IF(Коэффициенты!B199<>\"\",Коэффициенты!B199,\"\")","v":""},"",{"$f":"IF(Коэффициенты!C199<>\"\",Коэффициенты!C199,\"\")","v":""},{"$f":"IF(AND(AM199<>\"\",AN199<>\"\"),IF(OR(AM199<>\"\",AN199<>\"\"),IF(AN199=\"bye\",CONCATENATE($M$16,AM199,IF(AND(AM199<>\"\",AM199<>\"(Q)\"),VLOOKUP(AM199,$Q$11:$R$200,2,0),\"\"),\"..... vs \",AN199,$M$17),CONCATENATE(IF(J199=\"\",$M$12,\"\"),IF(AM199=J199,\"[b]\",\"\"),AM199,IF(AND(AM199<>\"\",AM199<>\"(Q)\"),VLOOKUP(AM199,$Q$11:$R$200,2,0),\"\"),IF(AM199=J199,\"[/b]\",\"\"),\"..... vs \",IF(AN199=J199,\"[b]\",\"\"),AN199,IF(AND(AN199<>\"\",AN199<>\"(Q)\"),VLOOKUP(AN199,$Q$11:$R$200,2,0),\"\"),IF(AN199=J199,\"[/b]\",\"\"),\"..... ( \",IF(AM199=J199,\"[b]\",\"\"),Коэффициенты!F199,IF(AM199=J199,\"[/b]\",\"\"),\" - \",IF(AN199=J199,\"[b]\",\"\"),Коэффициенты!G199,IF(AN199=J199,\"[/b]\",\"\"),\" )\",IF(J199=\"\",$M$13,\"\"))),\"\"),\"\")","v":""},null,null,null,null,null,null,null,null,null,null,{"$f":"IF(Коэффициенты!L199<>\"\",Коэффициенты!L199,\"\")","v":""},{"$f":"IF(Коэффициенты!M180<>\"\",Коэффициенты!M180,\"\")","v":""},null,null,null,null,null,null,null,null,null,null,null,null,null,null,null,null,null,null,null,null,null,{"$f":"IF(Коэффициенты!D199<>\"\",Коэффициенты!D199,\"\")","v":""},{"$f":"IF(Коэффициенты!E199<>\"\",Коэффициенты!E199,\"\")","v":""},""]
[null,{"$f":"IF(Коэффициенты!B200<>\"\",Коэффициенты!B200,\"\")","v":""},"",{"$f":"IF(Коэффициенты!C200<>\"\",Коэффициенты!C200,\"\")","v":""},{"$f":"IF(AND(AM200<>\"\",AN200<>\"\"),IF(OR(AM200<>\"\",AN200<>\"\"),IF(AN200=\"bye\",CONCATENATE($M$16,AM200,IF(AND(AM200<>\"\",AM200<>\"(Q)\"),VLOOKUP(AM200,$Q$11:$R$200,2,0),\"\"),\"..... vs \",AN200,$M$17),CONCATENATE(IF(J200=\"\",$M$12,\"\"),IF(AM200=J200,\"[b]\",\"\"),AM200,IF(AND(AM200<>\"\",AM200<>\"(Q)\"),VLOOKUP(AM200,$Q$11:$R$200,2,0),\"\"),IF(AM200=J200,\"[/b]\",\"\"),\"..... vs \",IF(AN200=J200,\"[b]\",\"\"),AN200,IF(AND(AN200<>\"\",AN200<>\"(Q)\"),VLOOKUP(AN200,$Q$11:$R$200,2,0),\"\"),IF(AN200=J200,\"[/b]\",\"\"),\"..... ( \",IF(AM200=J200,\"[b]\",\"\"),Коэффициенты!F200,IF(AM200=J200,\"[/b]\",\"\"),\" - \",IF(AN200=J200,\"[b]\",\"\"),Коэффициенты!G200,IF(AN200=J200,\"[/b]\",\"\"),\" )\",IF(J200=\"\",$M$13,\"\"))),\"\"),\"\")","v":""},null,null,null,null,null,null,null,null,null,null,{"$f":"IF(Коэффициенты!L200<>\"\",Коэффициенты!L200,\"\")","v":""},{"$f":"IF(Коэффициенты!M181<>\"\",Коэффициенты!M181,\"\")","v":""},null,null,null,null,null,null,null,null,null,null,null,null,null,null,null,null,null,null,null,null,null,{"$f":"IF(Коэффициенты!D200<>\"\",Коэффициенты!D200,\"\")","v":""},{"$f":"IF(Коэффициенты!E200<>\"\",Коэффициенты!E200,\"\")","v":""},""]
[null,null,null,null,{"$f":"IF(OR(Коэффициенты!D201<>\"\",Коэффициенты!E201<>\"\"),IF(Коэффициенты!E201=\"bye\",CONCATENATE($M$16,Коэффициенты!D201,IF(AND(Коэффициенты!D201<>\"\",Коэффициенты!D201<>\"(Q)\"),VLOOKUP(Коэффициенты!D201,$Q$11:$R$200,2,0),\"\"),\"..... vs \",Коэффициенты!E201,$M$17),CONCATENATE(IF(Коэффициенты!D201=J201,\"[b]\",\"\"),Коэффициенты!D201,IF(AND(Коэффициенты!D201<>\"\",Коэффициенты!D201<>\"(Q)\"),VLOOKUP(Коэффициенты!D201,$Q$11:$R$200,2,0),\"\"),IF(Коэффициенты!D201=J201,\"[/b]\",\"\"),\"..... vs \",IF(Коэффициенты!E201=J201,\"[b]\",\"\"),Коэффициенты!E201,IF(AND(Коэффициенты!E201<>\"\",Коэффициенты!E201<>\"(Q)\"),VLOOKUP(Коэффициенты!E201,$Q$11:$R$200,2,0),\"\"),IF(Коэффициенты!E201=J201,\"[/b]\",\"\"),\"..... ( \",IF(Коэффициенты!D201=J201,\"[b]\",\"\"),Коэффициенты!F201,IF(Коэффициенты!D201=J201,\"[/b]\",\"\"),\" - \",IF(Коэффициенты!E201=J201,\"[b]\",\"\"),Коэффициенты!G201,IF(Коэффициенты!E201=J201,\"[/b]\",\"\"),\" )\")),\"\")","v":""}]

{"sheet":"Лист1","index":2,"n_rows":96,"n_cols":7,"rows_kept":96,"cut":false,"hidden":false,"merged":[]}
["Entry deadline: June 25, 2012"]
["Seeding: August 6, 2012"]
[]
[1,"Djokovic","Novak","SRB",1,null,{"$f":"CONCATENATE(MID(C4,1,1),\". \",B4)","v":"N. Djokovic"}]
[2,"Nadal","Rafael","ESP",2,null,{"$f":"CONCATENATE(MID(C5,1,1),\". \",B5)","v":"R. Nadal"}]
[3,"Federer","Roger","SUI",3,null,"R. Federer"]
[4,"Murray","Andy","GBR",4,null,"A. Murray"]
[5,"Ferrer","David","ESP",5,null,"D. Ferrer"]
[6,"Tsonga","Jo-Wilfried","FRA",6,null,"J.-W. Tsonga"]
[7,"Berdych","Tomas","CZE",7,null,"T. Berdych"]
[8,"Tipsarevic","Janko","SRB",8,null,"J. Tipsarevic"]
[9,"Del Potro","Juan Martin","ARG",9,null,"J.M. Del Potro"]
[10,"Isner","John","USA",10,null,"J. Isner"]
[11,"Almagro","Nicolas","ESP",11,null,"N. Almagro"]
[12,"Fish","Mardy","USA",12,null,"M. Fish"]
[13,"Simon","Gilles","FRA",13,null,"G. Simon"]
[14,"Monaco","Juan","ARG",14,null,"J. Monaco"]
[15,"Monfils","Gael","FRA",15,null,"G. Monfils"]
[16,"Verdasco","Fernando","ESP",16,null,"F. Verdasco"]
[17,"Lopez","Feliciano","ESP",17,null,"F. Lopez"]
[18,"Cilic","Marin","CRO",18,null,"M. Cilic"]
[19,"Gasquet","Richard","FRA",19,null,"R. Gasquet"]
[20,"Nishikori","Kei","JPN",20,null,"K. Nishikori"]
[21,"Dolgopolov","Alexandr","UKR",21,null,"A. Dolgopolov"]
[22,"Raonic","Milos","CAN",22,null,"M. Raonic"]
[23,"Granollers","Marcel","ESP",23,null,"M. Granollers"]
[24,"Wawrinka","Stanislas","SUI",24,null,"S. Wawrinka"]
[25,"Roddick","Andy","USA",25,null,"A. Roddick"]
[26,"Seppi","Andreas","ITA",26,null,"A. Seppi"]
[27,"Stepanek","Radek","CZE",27,null,"R. Stepanek"]
[28,"Tomic","Bernard","AUS",28,null,"B. Tomic"]
[29,"Mayer","Florian","GER",29,null,"F. Mayer"]
[30,"Kohlschreiber","Philipp","GER",30,null,"P. Kohlschreiber"]
[31,"Anderson","Kevin","RSA",31,null,"K. Anderson"]
[32,"Benneteau","Julien","FRA",32,null,"J. Benneteau"]
[33,"Youzhny","Mikhail","RUS",33,null,"M. Youzhny"]
[34,"Troicki","Viktor","SRB",34,null,"V. Troicki"]
[35,"Melzer","Jurgen","AUT",35,null,"J. Melzer"]
[36,"Andujar","Pablo","ESP",36,null,"P. Andujar"]
[37,"Berlocq","Carlos","ARG",37,null,"C. Berlocq"]
[38,"Ferrero","Juan Carlos","ESP",38,null,"J.C. Ferrero"]
["39 (SE)",null,null,null,null,null,". "]
["40 (Q)",null,null,null,null,null,". "]
["41 (Q)",null,null,null,null,null,". "]
["42 (Q)",null,null,null,null,null,". "]
["43 (Q)",null,null,null,null,null,". "]
["44 (Q)",null,null,null,null,null,". "]
["45 (Q)",null,null,null,null,null,". "]
["46 (WC)",null,null,null,null,null,". "]
["47 (WC)",null,null,null,null,null,". "]
["48 (WC)",null,null,null,null,null,". "]
[null,null,null,null,null,null,". "]
["Alternates",null,null,null,null,null,". "]
[1,"Nalbandian","David","ARG",40,null,"D. Nalbandian"]
[2,"Baghdatis","Marcos","CYP",42,null,"M. Baghdatis"]
[3,"Ramos","Albert","ESP",43,null,"A. Ramos"]
[4,"Bogomolov Jr.","Alex","RUS",46,null,"A. Bogomolov Jr."]
[5,"Harrison","Ryan","USA",48,null,"R. Harrison"]
[6,"Kubot","Lukasz","POL",49,null,"L. Kubot"]
[7,"Haas","Tommy","GER",50,null,"T. Haas"]
[8,"Robredo","Tommy","ESP","@50",null,"T. Robredo"]
[9,"Young","Donald","USA",51,null,"D. Young"]
[10,"Kukushkin","Mikhail","KAZ",52,null,"M. Kukushkin"]
[]
["Пхх.1 K. Anderson d. M. Youzhny",{"$f":"MID(A65,10,99)","v":"Anderson d. M. Youzhny"}]
["Пхх.1 P. Andujar d. L. Lacko",{"$f":"MID(A66,10,99)","v":"Andujar d. L. Lacko"}]
["Пхх.1 M. Baghdatis d. C. Berlocq",{"$f":"MID(A67,10,99)","v":"Baghdatis d. C. Berlocq"}]
["Пхх.1 J. Benneteau d. W. Odesnik",{"$f":"MID(A68,10,99)","v":"Benneteau d. W. Odesnik"}]
["Пхх.1 C. Berlocq d. M. Baghdatis",{"$f":"MID(A69,10,99)","v":"Berlocq d. M. Baghdatis"}]
["Пхх.1 M. Berrer d. B. Tomic",{"$f":"MID(A70,10,99)","v":"Berrer d. B. Tomic"}]
["Пхх.1 A. Bogomolov Jr. d. V. Troicki",{"$f":"MID(A71,10,99)","v":"Bogomolov Jr. d. V. Troicki"}]
["Пхх.1 J. Chardy d. D. Young",{"$f":"MID(A72,10,99)","v":"Chardy d. D. Young"}]
["Пхх.1 F. Cipolla d. J. Zopp",{"$f":"MID(A73,10,99)","v":"Cipolla d. J. Zopp"}]
["Пхх.1 F. Dancevic d. M. Kukushkin",{"$f":"MID(A74,10,99)","v":"Dancevic d. M. Kukushkin"}]
["Пхх.1 A. Dolgopolov d. R. Stepanek",{"$f":"MID(A75,10,99)","v":"Dolgopolov d. R. Stepanek"}]
["Пхх.1 M. Ebden d. P. Polansky",{"$f":"MID(A76,10,99)","v":"Ebden d. P. Polansky"}]
["Пхх.1 F. Fognini d. Y.-H. Lu",{"$f":"MID(A77,10,99)","v":"Fognini d. Y.-H. Lu"}]
["Пхх.1 M. Granollers d. S. Stakhovsky",{"$f":"MID(A78,10,99)","v":"Granollers d. S. Stakhovsky"}]
["Пхх.1 Y.-H. Lu d. F. Fognini",{"$f":"MID(A79,10,99)","v":"H. Lu d. F. Fognini"}]
["Пхх.1 T. Haas d. D. Nalbandian",{"$f":"MID(A80,10,99)","v":"Haas d. D. Nalbandian"}]
["Пхх.1 M. Kukushkin d. F. Dancevic",{"$f":"MID(A81,10,99)","v":"Kukushkin d. F. Dancevic"}]
["Пхх.1 L. Lacko d. P. Andujar",{"$f":"MID(A82,10,99)","v":"Lacko d. P. Andujar"}]
["Пхх.1 J. Melzer d. S. Querrey",{"$f":"MID(A83,10,99)","v":"Melzer d. S. Querrey"}]
["Пхх.1 D. Nalbandian d. T. Haas",{"$f":"MID(A84,10,99)","v":"Nalbandian d. T. Haas"}]
["Пхх.1 W. Odesnik d. J. Benneteau",{"$f":"MID(A85,10,99)","v":"Odesnik d. J. Benneteau"}]
["Пхх.1 P. Polansky d. M. Ebden",{"$f":"MID(A86,10,99)","v":"Polansky d. M. Ebden"}]
["Пхх.1 V. Pospisil d. A. Seppi",{"$f":"MID(A87,10,99)","v":"Pospisil d. A. Seppi"}]
["Пхх.1 S. Querrey d. J. Melzer",{"$f":"MID(A88,10,99)","v":"Querrey d. J. Melzer"}]
["Пхх.1 A. Seppi d. V. Pospisil",{"$f":"MID(A89,10,99)","v":"Seppi d. V. Pospisil"}]
["Пхх.1 S. Stakhovsky d. M. Granollers",{"$f":"MID(A90,10,99)","v":"Stakhovsky d. M. Granollers"}]
["Пхх.1 R. Stepanek d. A. Dolgopolov",{"$f":"MID(A91,10,99)","v":"Stepanek d. A. Dolgopolov"}]
["Пхх.1 B. Tomic d. M. Berrer",{"$f":"MID(A92,10,99)","v":"Tomic d. M. Berrer"}]
["Пхх.1 V. Troicki d. A. Bogomolov Jr.",{"$f":"MID(A93,10,99)","v":"Troicki d. A. Bogomolov Jr."}]
["Пхх.1 D. Young d. J. Chardy",{"$f":"MID(A94,10,99)","v":"Young d. J. Chardy"}]
["Пхх.1 M. Youzhny d. K. Anderson",{"$f":"MID(A95,10,99)","v":"Youzhny d. K. Anderson"}]
["Пхх.1 J. Zopp d. F. Cipolla",{"$f":"MID(A96,10,99)","v":"Zopp d. F. Cipolla"}]